program: Gaussian 09
title: 000060378
version: EM64L-G09RevD.01
frameworkgroup: C1[X(C19H24N2O3)]
method: RPBEPBE
basis: SDD
operation: Freq
keyword: #p
keyword: freq=noraman
keyword: PBEPBE/SDD
title: #p freq=noraman PBEPBE/SDD
converged: YES YES NO NO
title: Mulliken charges:
elementType: O O O N N C C C C C C C C C C C C C C C C C C C H H H H H H H H H H H H H H H H H H H H H H H H
charge: -0.296673 -0.254949 -0.284449 -0.338146 -0.088868 0.234154 -0.357445 -0.253838 0.373072 0.292835 0.270161 -0.311770 -0.369814 -0.344036 -0.353665 -0.611985 -0.614442 -0.249102 -0.232353 -0.243435 -0.224898 -0.244374 -0.254663 -0.681543 0.227376 0.187484 0.236249 0.231661 0.259169 0.245490 0.251565 0.302600 0.222412 0.186816 0.228971 0.229017 0.185902 0.224143 0.230560 0.224749 0.221932 0.223666 0.209001 0.207906 0.225595 0.205867 0.239126 0.232968
chargesum: 0.00000
title: Mulliken charges with hydrogens summed into heavy atoms:
elementType: O O O N N C C C C C C C C C C C C C C C C C C C
charge: -0.296673 -0.254949 -0.284449 -0.338146 -0.088868 0.234154 0.057415 0.214073 0.373072 0.292835 0.270161 -0.052601 -0.124324 -0.092471 -0.051065 0.026213 0.024621 -0.018542 -0.007604 -0.021503 -0.001233 0.172533 -0.029068 -0.003582
polarizability: 2.66715948e+02 1.68525960e+01 2.39131031e+02 2.49345692e+00 -1.59556133e+01 1.91430597e+02
1716.lowfreq: -14.7090 -5.5623 0.0003 0.0005 0.0008 1.5948 6.1930 13.9561 20.5997
frequency: -13.8955 12.6492 20.5178 33.6893 40.0609 59.3803 63.6135 71.8614 78.6666 82.6338 114.5960 125.8388 153.5485 160.1410 173.0677 206.8436 210.0314 221.5565 228.4008 242.8919 266.7410 287.9675 318.8872 329.7336 342.8556 366.1901 380.5416 401.9166 407.3678 430.3829 478.5470 491.6490 492.3943 541.5097 553.2882 586.6047 615.0561 630.1514 655.7458 693.4122 695.2483 729.3081 751.5621 756.4281 762.7902 770.5336 800.6693 819.5270 826.9082 841.3129 851.3837 876.9849 905.1654 913.4603 935.9093 947.8752 972.9579 973.7951 984.5217 990.5193 1008.2410 1032.0599 1033.1863 1033.6118 1037.0971 1041.5077 1067.1575 1086.0996 1092.5119 1096.0442 1109.1049 1118.5213 1135.2355 1138.5159 1168.5957 1170.7218 1172.9891 1176.6474 1199.3012 1213.7800 1234.0852 1258.5086 1264.9161 1266.0142 1280.6796 1283.3852 1287.7438 1326.8689 1335.3444 1364.6814 1381.0972 1383.1256 1387.6629 1401.8982 1418.4131 1436.5057 1442.6849 1446.1456 1460.2834 1461.3668 1464.5411 1474.2343 1475.2907 1476.2170 1482.7942 1483.3983 1485.2490 1488.8353 1496.1379 1587.3422 1591.6143 1604.8284 1610.9278 1633.0616 2846.3469 2852.5088 2870.2124 2956.4896 2998.6985 3015.3933 3017.9970 3020.5451 3030.7990 3041.5165 3079.4798 3086.3468 3092.9266 3096.1025 3108.9042 3125.5104 3132.9267 3136.1048 3146.1016 3157.2327 3161.5279 3171.4520 3172.6082 3203.6072
redmass: 2.5954 3.9559 4.5461 4.0248 3.9108 4.1086 5.7538 4.2105 3.5190 2.2614 2.0414 3.3370 3.3111 4.3398 4.4236 3.4926 3.4351 1.1897 1.3918 1.2263 3.0497 4.2211 4.5084 4.5763 2.5713 4.5017 4.9429 3.9778 2.9437 2.6044 3.9824 3.6687 3.4825 4.2396 4.2360 6.3524 6.3058 5.8843 6.4538 2.8812 4.3334 4.5221 3.2428 1.5234 1.7496 4.0949 1.2258 2.9678 1.2505 1.2512 1.4445 5.2751 3.4147 1.4596 1.4118 6.5792 1.3425 1.3335 5.1781 1.3417 7.2033 2.2595 2.7133 1.5569 2.2254 2.1096 1.6061 1.4594 1.6638 2.1279 2.0600 1.9700 1.4389 1.4728 1.9199 1.1199 1.1019 1.6889 1.1922 3.0423 1.7628 2.4923 1.1435 2.4742 1.6442 1.5004 3.0036 1.3788 1.5572 1.6676 6.1276 3.9803 1.4896 1.2929 1.1489 2.3372 1.1710 2.4565 1.0395 1.0478 1.0701 1.0857 1.1267 1.1179 1.5706 1.2399 1.3869 1.0753 1.6020 6.4022 7.2702 6.7568 6.1461 10.5743 1.0572 1.0628 1.0646 1.0554 1.0364 1.1075 1.0575 1.0722 1.0717 1.0885 1.1014 1.1026 1.1059 1.0989 1.1014 1.0849 1.0856 1.0905 1.0904 1.0958 1.0938 1.0968 1.0999 1.0938
irintensity: 0.3503 0.1364 0.3032 0.3669 0.1050 0.6374 1.7555 2.2830 0.3341 2.5629 1.5049 0.9428 0.1444 1.2133 0.0832 0.2673 0.8840 1.0672 0.7640 0.5941 6.2803 4.4644 5.1688 3.2035 14.6761 2.9244 0.1393 2.1020 0.8222 6.8211 0.8360 7.7900 16.3142 6.6944 2.2064 4.4410 0.4311 14.4368 9.7558 34.7509 1.4907 8.5139 18.0902 62.0009 74.5980 18.3194 3.0789 9.8715 1.5151 0.9492 0.7587 1.8162 30.4335 12.1790 1.1961 1.1896 0.8633 0.4352 2.9270 1.6046 177.2973 93.2538 56.7206 12.8808 66.3268 28.5690 16.3936 6.0212 8.4523 5.5421 41.3740 37.4299 4.4102 7.6348 145.1687 21.8553 7.5741 37.8757 30.6642 102.2078 18.3039 179.2263 0.6891 21.1188 84.3738 33.5001 370.5682 17.9685 78.2487 5.7125 7.3705 16.8762 30.4797 37.3188 2.3666 21.8410 3.8815 18.7625 11.0412 15.8563 6.0266 9.5435 31.4442 29.0159 110.3858 10.0578 69.6319 15.0468 31.6123 1.6679 4.3803 38.0621 86.7400 280.2574 69.0342 95.6227 182.6779 43.4439 20.7758 35.7343 17.4978 41.6047 57.3372 8.1894 20.5017 50.8175 34.0940 27.8944 28.7944 0.6894 2.5134 20.7727 13.1936 40.3285 20.4443 8.9250 15.6307 6.9683
temp: 298.150 k
press: 1.00000 atm
elementType: 8 8 8 7 7 6 6 6 6 6 6 6 6 6 6 6 6 6 6 6 6 6 6 6 1 1 1 1 1 1 1 1 1 1 1 1 1 1 1 1 1 1 1 1 1 1 1 1
symmnumber: 1
zpe: 1033609.1 jmol-1
zpe.correction: 0.393681 hartree
zpe.thermalcorrener: 0.417411 hartree
zpe.thermalcorrenthalpy: 0.418355 hartree
zpe.thermalcorrgfe: 0.337574 hartree
zpe.sumelectzpe: -1071.779950 hartree
zpe.sumelectthermal: -1071.756221 hartree
zpe.sumelectthermalent: -1071.755276 hartree
zpe.sumelectthermalfe: -1071.836057 hartree
dipole: 1.9440 4.5594 1.2666
dipole: 5.1158
quadrupole: -130.2249 -137.1674 -134.2177
quadrupole: 1.3412 4.0695 2.4061
quadrupole: 3.6451 -3.2974 -0.3477 1.3412 4.0695 2.4061
hfenergy: -1072.1736314 hartree
pointgroup: C01 [X(C19H24N2O3)]
dipole: -0.7262628 1.7334175 -0.7203092 debye
polarizability: 265.9197688|-16.9144987|243.3248457|4.1432032|9.3034088|188.0329619 unknown
InChI: InChI=1S/C19H24N2O3/c1-4-23-18-13-9-8-12-17(18)21(16-10-6-5-7-11-16)19(22)24-15-14-20(2)3/h5-13H,4,14-15H2,1-3H3
charge 0 multiplicity 1
48 atoms
O  -1.42358 -0.638849 0.663483
O  0.076545 0.915717 -1.688437
O  -0.293876 -2.64338 0.255248
N  0.862659 -0.574556 0.486911
N  -5.148555 -0.959016 0.590183
C  0.661885 0.857444 0.625648
C  -3.805063 -0.339343 0.532349
C  -2.699845 -1.398965 0.629584
C  2.210294 -1.065764 0.304911
C  0.264961 1.629133 -0.50394
C  -0.267474 -1.400413 0.442346
C  0.881766 1.486698 1.864228
C  0.086574 3.027968 -0.366875
C  3.250532 -0.125298 0.067113
C  2.536367 -2.448652 0.378281
C  -6.193723 0.000768 0.999898
C  -5.517379 -1.675323 -0.648652
C  0.709611 2.883117 2.004084
C  0.310985 3.645723 0.884829
C  4.583471 -0.556884 -0.089311
C  3.876056 -2.862848 0.218391
C  -0.351339 1.660535 -2.890762
C  4.910717 -1.929297 -0.014013
C  -0.477564 0.637832 -4.016227
H  -3.699245 0.346629 1.392197
H  -3.648977 0.268864 -0.394725
H  -2.801129 -1.988181 1.557764
H  -2.679135 -2.091831 -0.229294
H  1.189402 0.869137 2.714604
H  -0.221298 3.638101 -1.220862
H  3.021067 0.941682 0.00476
H  1.747946 -3.184339 0.536947
H  -7.156059 -0.529303 1.117427
H  -6.348375 0.833093 0.266309
H  -5.929802 0.447679 1.974595
H  -4.781457 -2.465634 -0.873771
H  -5.585865 -1.0003 -1.540543
H  -6.499113 -2.162581 -0.51255
H  0.880938 3.363979 2.972218
H  0.171974 4.72852 0.979722
H  5.366628 0.187509 -0.272885
H  4.106885 -3.932697 0.277991
H  0.405494 2.435019 -3.131827
H  -1.319961 2.161244 -2.685856
H  5.946876 -2.262891 -0.135214
H  -0.795863 1.137749 -4.949165
H  0.48897 0.137964 -4.196497
H  -1.222327 -0.13416 -3.758616
