program: Orca
programVersion: 5.0.2
elementType: Cl F F F O O O N C C C C C C C C C C C C C C C C C C C C C C C H H H H H H H H H H H H H H H H H H H
charge: 0
multiplicity: 1
keywords: wb97x-d3
keywords: def2-TZVPP
keywords: def2/J RIJCOSX
keywords: DEFGRID2
keywords: scfconv7
keywords: smallprint printgap noloewdin
keywords: NOSOSCF
formula: C23H19ClF3NO3
InChI: InChI=1/C23H19ClF3NO3/c1-22(2)17(12-19(24)23(25,26)27)20(22)21(29)31-18(13-28)14-7-6-10-16(11-14)30-15-8-4-3-5-9-15/h3-12,17-18,20H,1-2H3
50 atoms
Cl -3.67401 4.258225 -1.053866
F  -4.201795 0.424737 -0.772946
F  -5.42782 1.894976 -1.757408
F  -5.074193 2.036475 0.355562
O  1.772189 1.680117 0.796099
O  0.027916 0.459459 0.127518
O  2.94305 -4.181383 0.82318
N  3.923546 1.596603 3.301144
C  0.275739 2.413241 -2.344282
C  -0.881478 2.900773 -1.518732
C  0.459736 2.615264 -0.85409
C  0.291014 1.03024 -2.947395
C  0.948297 3.443663 -3.218961
C  -2.071427 2.087599 -1.262787
C  0.67708 1.469129 0.044494
C  -3.292999 2.570998 -1.063177
C  2.183446 0.603335 1.624265
C  -4.498646 1.723238 -0.810137
C  2.814984 -0.521707 0.834486
C  3.158558 1.180151 2.552444
C  2.544248 -1.830053 1.205175
C  3.666295 -0.242553 -0.227361
C  3.128576 -2.872891 0.496504
C  4.242863 -1.294765 -0.92225
C  3.976009 -2.608497 -0.57128
C  1.77138 -4.593567 1.403212
C  0.533146 -4.237513 0.882575
C  1.866177 -5.436774 2.499772
C  -0.6172 -4.729728 1.480941
C  0.706804 -5.932597 3.079846
C  -0.53736 -5.576489 2.578952
H  -1.071992 3.964388 -1.597208
H  1.016979 3.501331 -0.574056
H  1.318772 0.673291 -3.037762
H  -0.265579 0.281991 -2.389214
H  -0.132457 1.068599 -3.95242
H  0.434126 3.522478 -4.178489
H  0.951194 4.432636 -2.759696
H  1.984622 3.164244 -3.417254
H  -1.966457 1.01203 -1.244537
H  1.349056 0.223956 2.224089
H  1.88357 -2.024972 2.041299
H  3.884504 0.777993 -0.51469
H  4.906073 -1.091089 -1.752501
H  4.424347 -3.427847 -1.118922
H  0.460958 -3.587345 0.019243
H  2.839312 -5.70657 2.890769
H  -1.582862 -4.452469 1.078269
H  0.780846 -6.594377 3.93314
H  -1.439691 -5.958479 3.037819
elementType: Cl F O N C H
totalener: -1928.18732116 hartree
nucrepener: 3133.54781338 hartree
electener: -5061.73513454 hartree
oneelecener: -8873.87241175 hartree
twoeener: 3812.13727721 hartree
cpcmener: -0.03178413 hartree
kineticenergy: 1921.61328577 hartree
xcener: -157.113722835624 hartree
chargesum: 0.0000000
charge: -0.072706 -0.170875 -0.173748 -0.173316 -0.280058 -0.438829 -0.325799 -0.086485 0.075374 0.023941 -0.053539 -0.266161 -0.252459 -0.150366 0.368488 -0.085493 0.402777 0.510016 0.022007 -0.226201 -0.187405 -0.234053 0.274583 -0.121677 -0.222175 0.274803 -0.190925 -0.240377 -0.141049 -0.124035 -0.179627 0.095198 0.104678 0.100786 0.097147 0.104174 0.098867 0.090524 0.096527 0.144250 0.141349 0.139976 0.146086 0.158072 0.148303 0.157905 0.146522 0.159221 0.158033 0.157751
qa: -0.0727 -0.1709 -0.1737 -0.1733 -0.2801 -0.4388 -0.3258 -0.0865 0.0754 0.0239 -0.0535 -0.2662 -0.2525 -0.1504 0.3685 -0.0855 0.4028 0.5100 0.0220 -0.2262 -0.1874 -0.2341 0.2746 -0.1217 -0.2222 0.2748 -0.1909 -0.2404 -0.1410 -0.1240 -0.1796 0.0952 0.1047 0.1008 0.0971 0.1042 0.0989 0.0905 0.0965 0.1443 0.1413 0.1400 0.1461 0.1581 0.1483 0.1579 0.1465 0.1592 0.1580 0.1578
va: 1.2627 1.1329 1.1251 1.1257 2.1269 2.0571 2.0844 3.1138 3.8081 3.8106 3.8561 3.9050 3.9061 3.8556 4.1480 4.0104 3.7308 4.4851 3.6220 4.0733 3.9601 3.9547 3.7401 3.9102 3.9988 3.6959 3.9213 4.0126 3.8895 3.8835 3.9046 1.0292 1.0279 1.0006 1.0127 1.0013 1.0016 1.0054 1.0023 1.0293 1.0201 1.0078 1.0127 0.9893 1.0052 0.9972 1.0074 0.9901 0.9892 0.9904
dispcorr: -0.025134824 hartree
energy: -1928.212455984258
dipole: 37.27406 -36.71199 0.56206 -19.32619 19.16897 -0.15722 -7.73366 5.91397 -1.81969
magnitude: 1.91100 au
magnitude: 4.85737 debye
