program: Orca
programVersion: 5.0.2
elementType: Cl F F F O O O N C C C C C C C C C C C C C C C C C C C C C C C H H H H H H H H H H H H H H H H H H H
charge: 0
multiplicity: 1
keywords: wb97x-d3
keywords: def2-TZVPP
keywords: def2/J RIJCOSX
keywords: DEFGRID2
keywords: scfconv7
keywords: smallprint printgap noloewdin
keywords: NOSOSCF
formula: C23H19ClF3NO3
InChI: InChI=1/C23H19ClF3NO3/c1-22(2)17(12-19(24)23(25,26)27)20(22)21(29)31-18(13-28)14-7-6-10-16(11-14)30-15-8-4-3-5-9-15/h3-12,17-18,20H,1-2H3
50 atoms
Cl -4.22978 2.589892 -2.284253
F  -3.912818 4.880657 -0.379358
F  -2.764409 5.198322 -2.16459
F  -1.762146 4.823498 -0.293912
O  1.383794 -0.672285 -1.622663
O  0.967256 1.2951 -0.644986
O  2.385309 -2.546911 2.973122
N  3.871942 -1.880826 -3.406293
C  -1.716314 -0.292691 -0.00286
C  -2.04664 0.694886 -1.089557
C  -0.829262 -0.203514 -1.227735
C  -1.22951 0.175478 1.345673
C  -2.586036 -1.522667 0.077612
C  -1.96889 2.139045 -0.866797
C  0.560342 0.268236 -1.120782
C  -2.860582 3.016259 -1.317205
C  2.776231 -0.462131 -1.502773
C  -2.815983 4.483584 -1.034859
C  3.332074 -0.89457 -0.158273
C  3.377181 -1.265822 -2.57205
C  2.538467 -1.559444 0.766088
C  4.664611 -0.617649 0.116651
C  3.095819 -1.946025 1.980825
C  5.206196 -1.01878 1.32765
C  4.430688 -1.684257 2.262131
C  1.205957 -3.198598 2.723695
C  1.108361 -4.193721 1.758835
C  0.122157 -2.879724 3.528642
C  -0.095819 -4.863694 1.598995
C  -1.072403 -3.567854 3.367416
C  -1.188632 -4.555923 2.399624
H  -2.848983 0.38327 -1.747395
H  -0.954743 -1.011155 -1.939235
H  -2.085866 0.429409 1.973509
H  -0.684443 -0.628808 1.844234
H  -0.576546 1.044875 1.318173
H  -3.457188 -1.332826 0.708047
H  -2.944684 -1.835482 -0.903656
H  -2.033023 -2.356572 0.514931
H  -1.151931 2.528603 -0.27375
H  3.040713 0.585075 -1.691269
H  1.500075 -1.776081 0.55351
H  5.277199 -0.095924 -0.608672
H  6.244943 -0.811009 1.547843
H  4.851988 -1.993495 3.210167
H  1.959653 -4.450755 1.140445
H  0.217263 -2.106231 4.28039
H  -0.175002 -5.637801 0.846309
H  -1.91637 -3.322961 3.999139
H  -2.123223 -5.086036 2.272148
elementType: Cl F O N C H
totalener: -1928.18607789 hartree
nucrepener: 3203.86065472 hartree
electener: -5132.04673261 hartree
oneelecener: -9013.96571039 hartree
twoeener: 3881.91897778 hartree
cpcmener: -0.03093857 hartree
kineticenergy: 1921.59289179 hartree
xcener: -157.113618391404 hartree
chargesum: 0.0000000
charge: -0.073181 -0.173971 -0.173762 -0.170391 -0.284355 -0.431605 -0.320732 -0.085577 0.109492 0.032222 -0.072339 -0.264502 -0.252386 -0.168473 0.365041 -0.082083 0.395714 0.510749 0.040288 -0.231498 -0.224992 -0.258413 0.335870 -0.091031 -0.259690 0.304970 -0.216937 -0.257861 -0.112750 -0.116581 -0.195113 0.095759 0.105227 0.110971 0.076262 0.103202 0.100880 0.095007 0.078303 0.147286 0.145470 0.133953 0.147301 0.157896 0.145825 0.157642 0.147294 0.160280 0.157735 0.157586
qa: -0.0732 -0.1740 -0.1738 -0.1704 -0.2844 -0.4316 -0.3207 -0.0856 0.1095 0.0322 -0.0723 -0.2645 -0.2524 -0.1685 0.3650 -0.0821 0.3957 0.5107 0.0403 -0.2315 -0.2250 -0.2584 0.3359 -0.0910 -0.2597 0.3050 -0.2169 -0.2579 -0.1127 -0.1166 -0.1951 0.0958 0.1052 0.1110 0.0763 0.1032 0.1009 0.0950 0.0783 0.1473 0.1455 0.1340 0.1473 0.1579 0.1458 0.1576 0.1473 0.1603 0.1577 0.1576
va: 1.2622 1.1238 1.1262 1.1342 2.1114 2.0622 2.0983 3.1157 3.7453 3.8038 3.8905 3.8904 3.9108 3.8616 4.1423 4.0084 3.7199 4.4844 3.6820 4.0544 3.9563 4.0135 3.6855 3.8853 4.0090 3.6380 3.9319 3.9599 3.8359 3.8230 3.8753 1.0293 1.0292 1.0014 1.0148 1.0175 1.0013 1.0089 1.0084 1.0294 1.0195 1.0114 1.0020 0.9889 1.0079 0.9965 1.0086 0.9886 0.9895 0.9919
dispcorr: -0.028326107 hartree
energy: -1928.214404000524
dipole: 15.89730 -16.48942 -0.59212 -43.17310 41.69153 -1.48157 21.85155 -20.42583 1.42571
magnitude: 2.13970 au
magnitude: 5.43868 debye
