program: Orca
programVersion: 5.0.2
elementType: Cl F F F O O O N C C C C C C C C C C C C C C C C C C C C C C C H H H H H H H H H H H H H H H H H H H
charge: 0
multiplicity: 1
keywords: wb97x-d3
keywords: def2-TZVPP
keywords: def2/J RIJCOSX
keywords: DEFGRID2
keywords: scfconv7
keywords: smallprint printgap noloewdin
keywords: NOSOSCF
formula: C23H19ClF3NO3
InChI: InChI=1/C23H19ClF3NO3/c1-22(2)17(12-19(24)23(25,26)27)20(22)21(29)31-18(13-28)14-7-6-10-16(11-14)30-15-8-4-3-5-9-15/h3-12,17-18,20H,1-2H3
50 atoms
Cl -4.011734 3.415873 -2.446649
F  -2.37209 5.90203 -2.194815
F  -1.735175 4.772101 -3.903888
F  -0.450174 4.932138 -2.183855
O  0.220382 -1.242189 -1.228566
O  0.734591 0.921629 -1.07256
O  2.411852 -2.380565 3.274697
N  1.654272 -3.966017 -2.417678
C  -1.897337 0.927024 0.662267
C  -2.284089 1.45692 -0.691611
C  -1.494581 0.1583 -0.577876
C  -0.871909 1.633826 1.513024
C  -3.001725 0.299469 1.477504
C  -1.699457 2.676954 -1.249629
C  -0.082462 0.042834 -0.979054
C  -2.349905 3.564065 -1.995399
C  1.587941 -1.521634 -1.498577
C  -1.719296 4.795239 -2.565689
C  2.449109 -1.422677 -0.259711
C  1.602638 -2.890454 -2.017885
C  1.99916 -1.985343 0.929293
C  3.673288 -0.775491 -0.322567
C  2.798379 -1.900193 2.060695
C  4.459297 -0.696939 0.818803
C  4.030733 -1.258267 2.009098
C  1.617659 -3.492859 3.371609
C  1.861669 -4.640649 2.626756
C  0.591073 -3.45534 4.303842
C  1.05912 -5.755136 2.821665
C  -0.194609 -4.582545 4.497795
C  0.031443 -5.733386 3.755686
H  -3.317042 1.280791 -0.966913
H  -2.07625 -0.73423 -0.775597
H  -1.365803 2.401583 2.110762
H  -0.408781 0.927454 2.204482
H  -0.074319 2.117766 0.956852
H  -3.519585 1.059097 2.065784
H  -3.742037 -0.200787 0.85229
H  -2.594889 -0.439225 2.17067
H  -0.660475 2.887363 -1.038845
H  1.978716 -0.866844 -2.284094
H  1.035791 -2.479615 0.971098
H  4.010659 -0.332959 -1.251027
H  5.415434 -0.19198 0.78184
H  4.642192 -1.196575 2.900409
H  2.669343 -4.674392 1.90588
H  0.416192 -2.55373 4.877863
H  1.247263 -6.649832 2.242012
H  -0.992077 -4.555018 5.229369
H  -0.586619 -6.608669 3.905595
elementType: Cl F O N C H
totalener: -1928.18763155 hartree
nucrepener: 3140.86097353 hartree
electener: -5069.04860508 hartree
oneelecener: -8888.58577520 hartree
twoeener: 3819.53717012 hartree
cpcmener: -0.03107067 hartree
kineticenergy: 1921.61414068 hartree
xcener: -157.114182209370 hartree
chargesum: -0.0000000
charge: -0.072529 -0.174119 -0.174055 -0.170778 -0.286275 -0.437815 -0.327148 -0.087300 0.073700 0.034581 -0.063516 -0.267020 -0.251226 -0.160242 0.375064 -0.086415 0.421117 0.510615 0.026295 -0.229512 -0.217005 -0.210801 0.267204 -0.108000 -0.237368 0.291092 -0.197366 -0.254039 -0.138467 -0.118473 -0.184797 0.094389 0.104438 0.104961 0.100927 0.097367 0.097991 0.091117 0.096633 0.147906 0.144332 0.144613 0.145082 0.158918 0.148207 0.155751 0.146155 0.159925 0.157797 0.158092
qa: -0.0725 -0.1741 -0.1741 -0.1708 -0.2863 -0.4378 -0.3271 -0.0873 0.0737 0.0346 -0.0635 -0.2670 -0.2512 -0.1602 0.3751 -0.0864 0.4211 0.5106 0.0263 -0.2295 -0.2170 -0.2108 0.2672 -0.1080 -0.2374 0.2911 -0.1974 -0.2540 -0.1385 -0.1185 -0.1848 0.0944 0.1044 0.1050 0.1009 0.0974 0.0980 0.0911 0.0966 0.1479 0.1443 0.1446 0.1451 0.1589 0.1482 0.1558 0.1462 0.1599 0.1578 0.1581
va: 1.2628 1.1256 1.1238 1.1330 2.1282 2.0593 2.0827 3.1114 3.8021 3.7971 3.8767 3.9044 3.9069 3.8534 4.1449 4.0133 3.7202 4.4825 3.6084 4.0785 3.9295 3.9858 3.7400 3.8977 4.0077 3.6807 3.9198 4.0107 3.8888 3.8801 3.9094 1.0286 1.0279 1.0006 1.0001 1.0138 1.0016 1.0052 1.0029 1.0302 1.0169 1.0186 1.0027 0.9891 1.0053 0.9979 1.0083 0.9900 0.9892 0.9906
dispcorr: -0.025341080 hartree
energy: -1928.212972628067
dipole: 11.72394 -12.04084 -0.31691 -38.71831 38.24499 -0.47332 36.48787 -34.65327 1.83460
magnitude: 1.92100 au
magnitude: 4.88278 debye
