program: Orca
programVersion: 5.0.2
elementType: Cl F F F O O O N C C C C C C C C C C C C C C C C C C C C C C C H H H H H H H H H H H H H H H H H H H
charge: 0
multiplicity: 1
keywords: wb97x-d3
keywords: def2-TZVPP
keywords: def2/J RIJCOSX
keywords: DEFGRID2
keywords: scfconv7
keywords: smallprint printgap noloewdin
keywords: NOSOSCF
formula: C23H19ClF3NO3
InChI: InChI=1/C23H19ClF3NO3/c1-22(2)17(12-19(24)23(25,26)27)20(22)21(29)31-18(13-28)14-7-6-10-16(11-14)30-15-8-4-3-5-9-15/h3-12,17-18,20H,1-2H3
50 atoms
Cl -4.001473 3.760242 -2.429645
F  -1.937761 5.919877 -2.930021
F  -2.00863 4.481431 -4.521575
F  -0.291137 4.567996 -3.228686
O  -0.207325 -1.171013 -0.737445
O  0.617015 0.865029 -1.127616
O  2.689036 -2.654936 3.361164
N  0.491283 -4.229353 -1.744052
C  -1.714054 1.715274 0.804648
C  -2.238942 1.925586 -0.589041
C  -1.591197 0.598299 -0.209477
C  -0.503392 2.464852 1.300646
C  -2.750527 1.49355 1.879543
C  -1.615156 2.867044 -1.520188
C  -0.287033 0.169564 -0.742166
C  -2.276578 3.683401 -2.333321
C  1.024408 -1.736205 -1.174145
C  -1.619656 4.661883 -3.254616
C  2.097446 -1.658138 -0.114432
C  0.709531 -3.131031 -1.489938
C  1.86027 -2.216924 1.136563
C  3.298598 -1.023579 -0.392242
C  2.853259 -2.157932 2.10346
C  4.275193 -0.956451 0.591648
C  4.062161 -1.525718 1.835271
C  1.944447 -3.782043 3.585455
C  1.997114 -4.889018 2.746821
C  1.171716 -3.802598 4.738088
C  1.251772 -6.014947 3.066085
C  0.443785 -4.941474 5.051855
C  0.473756 -6.048693 4.215629
H  -3.31492 1.839718 -0.682801
H  -2.296281 -0.214897 -0.085012
H  -0.81488 3.429066 1.70482
H  -0.026947 1.909461 2.110057
H  0.254166 2.656976 0.546569
H  -3.090995 2.448643 2.282982
H  -3.623587 0.959484 1.50356
H  -2.3325 0.913205 2.703952
H  -0.535822 2.920303 -1.5489
H  1.370865 -1.261475 -2.097587
H  0.912024 -2.69727 1.349591
H  3.472111 -0.585142 -1.366413
H  5.21496 -0.461082 0.386601
H  4.826679 -1.481102 2.600867
H  2.609441 -4.884019 1.853768
H  1.146011 -2.935144 5.385984
H  1.288424 -6.87482 2.40966
H  -0.155415 -4.956274 5.953193
H  -0.101605 -6.932163 4.458933
elementType: Cl F O N C H
totalener: -1928.18781333 hartree
nucrepener: 3102.02928301 hartree
electener: -5030.21709634 hartree
oneelecener: -8811.01471424 hartree
twoeener: 3780.79761790 hartree
cpcmener: -0.03036076 hartree
kineticenergy: 1921.61897762 hartree
xcener: -157.114886649399 hartree
chargesum: -0.0000000
charge: -0.073159 -0.173646 -0.174024 -0.170628 -0.284992 -0.445177 -0.325204 -0.087757 0.076896 0.039173 -0.085899 -0.266116 -0.254114 -0.164507 0.399277 -0.085386 0.427909 0.510506 0.019646 -0.231677 -0.220654 -0.201869 0.265303 -0.110222 -0.237888 0.301509 -0.206103 -0.258065 -0.136679 -0.115194 -0.189630 0.094882 0.105372 0.103124 0.103046 0.096749 0.097878 0.091016 0.097797 0.150697 0.140300 0.148176 0.145686 0.159432 0.148324 0.155285 0.145518 0.159642 0.157518 0.157930
qa: -0.0732 -0.1736 -0.1740 -0.1706 -0.2850 -0.4452 -0.3252 -0.0878 0.0769 0.0392 -0.0859 -0.2661 -0.2541 -0.1645 0.3993 -0.0854 0.4279 0.5105 0.0196 -0.2317 -0.2207 -0.2019 0.2653 -0.1102 -0.2379 0.3015 -0.2061 -0.2581 -0.1367 -0.1152 -0.1896 0.0949 0.1054 0.1031 0.1030 0.0967 0.0979 0.0910 0.0978 0.1507 0.1403 0.1482 0.1457 0.1594 0.1483 0.1553 0.1455 0.1596 0.1575 0.1579
va: 1.2619 1.1236 1.1262 1.1334 2.1393 2.0557 2.0886 3.1100 3.7913 3.7805 3.9093 3.9048 3.9090 3.8506 4.1180 4.0097 3.7274 4.4841 3.5874 4.0746 3.9554 3.9654 3.7563 3.9015 4.0117 3.6794 3.9138 4.0140 3.8874 3.8797 3.9123 1.0280 1.0269 1.0004 0.9995 1.0138 1.0016 1.0052 1.0022 1.0294 1.0166 1.0138 1.0059 0.9891 1.0053 0.9978 1.0086 0.9900 0.9892 0.9907
dispcorr: -0.024714851 hartree
energy: -1928.212528180054
dipole: 14.04994 -13.96083 0.08912 -34.27445 34.22889 -0.04556 40.96273 -39.05621 1.90653
magnitude: 1.90915 au
magnitude: 4.85268 debye
