program: Orca
programVersion: 5.0.2
elementType: Cl F F F O O O N C C C C C C C C C C C C C C C C C C C C C C C H H H H H H H H H H H H H H H H H H H
charge: 0
multiplicity: 1
keywords: wb97x-d3
keywords: def2-TZVPP
keywords: def2/J RIJCOSX
keywords: DEFGRID2
keywords: scfconv7
keywords: smallprint printgap noloewdin
keywords: NOSOSCF
formula: C23H19ClF3NO3
InChI: InChI=1/C23H19ClF3NO3/c1-22(2)17(12-19(24)23(25,26)27)20(22)21(29)31-18(13-28)14-7-6-10-16(11-14)30-15-8-4-3-5-9-15/h3-12,17-18,20H,1-2H3
50 atoms
Cl -3.555511 4.644808 -1.579357
F  -4.269805 0.834387 -1.708674
F  -5.25974 2.475609 -2.690444
F  -5.257434 2.357473 -0.547682
O  1.398564 1.503951 1.014386
O  -0.156322 0.434093 -0.175394
O  2.427666 -4.308371 0.355774
N  2.918367 1.058757 3.912225
C  0.451834 2.751759 -2.219284
C  -0.783776 3.178563 -1.476306
C  0.444253 2.704882 -0.706446
C  0.4691 1.487582 -3.041737
C  1.280516 3.858406 -2.824765
C  -2.028941 2.41154 -1.528169
C  0.487017 1.430304 0.02982
C  -3.245051 2.943584 -1.585846
C  1.612813 0.321941 1.772116
C  -4.507693 2.143591 -1.635703
C  2.423694 -0.710233 1.022383
C  2.342874 0.757464 2.965173
C  2.017062 -2.035197 1.048695
C  3.571764 -0.331047 0.336321
C  2.784628 -2.994621 0.398848
C  4.310585 -1.296256 -0.328925
C  3.929573 -2.629005 -0.294521
C  1.830183 -4.901977 1.436403
C  0.774536 -5.764578 1.180801
C  2.293116 -4.709057 2.732532
C  0.178293 -6.443465 2.234023
C  1.678424 -5.384428 3.776827
C  0.621989 -6.252759 3.535041
H  -0.916607 4.251069 -1.402128
H  0.990938 3.503481 -0.219553
H  1.48826 1.105016 -3.116777
H  -0.152972 0.684136 -2.657996
H  0.126977 1.709987 -4.053556
H  1.267572 4.762062 -2.214854
H  2.319802 3.544264 -2.936165
H  0.902641 4.117746 -3.815107
H  -1.968709 1.332081 -1.534051
H  0.664935 -0.109502 2.109539
H  1.108972 -2.311359 1.571333
H  3.89303 0.702775 0.31939
H  5.203998 -1.012722 -0.869486
H  4.515206 -3.383617 -0.804319
H  0.428763 -5.907423 0.164578
H  3.125309 -4.045444 2.932585
H  -0.641707 -7.120609 2.032766
H  2.036844 -5.233582 4.786961
H  0.151727 -6.779781 4.354715
elementType: Cl F O N C H
totalener: -1928.18763092 hartree
nucrepener: 3088.58777521 hartree
electener: -5016.77540613 hartree
oneelecener: -8784.11825063 hartree
twoeener: 3767.34284449 hartree
cpcmener: -0.03141892 hartree
kineticenergy: 1921.61827266 hartree
xcener: -157.114408914105 hartree
chargesum: -0.0000000
charge: -0.072807 -0.170528 -0.173756 -0.173611 -0.280747 -0.441554 -0.326859 -0.086851 0.077646 0.032930 -0.078031 -0.266445 -0.252555 -0.159372 0.387929 -0.085365 0.405965 0.510302 0.020790 -0.224044 -0.177311 -0.225195 0.252287 -0.127688 -0.218506 0.272342 -0.244639 -0.184635 -0.121931 -0.144849 -0.181723 0.095368 0.104824 0.102561 0.097597 0.103148 0.090833 0.096457 0.098411 0.149193 0.140301 0.145234 0.147512 0.158950 0.148890 0.146857 0.157274 0.157849 0.159825 0.157727
qa: -0.0728 -0.1705 -0.1738 -0.1736 -0.2807 -0.4416 -0.3269 -0.0869 0.0776 0.0329 -0.0780 -0.2664 -0.2526 -0.1594 0.3879 -0.0854 0.4060 0.5103 0.0208 -0.2240 -0.1773 -0.2252 0.2523 -0.1277 -0.2185 0.2723 -0.2446 -0.1846 -0.1219 -0.1448 -0.1817 0.0954 0.1048 0.1026 0.0976 0.1031 0.0908 0.0965 0.0984 0.1492 0.1403 0.1452 0.1475 0.1590 0.1489 0.1469 0.1573 0.1578 0.1598 0.1577
va: 1.2625 1.1336 1.1261 1.1241 2.1331 2.0595 2.0806 3.1122 3.7917 3.7937 3.8944 3.9043 3.9091 3.8540 4.1282 4.0123 3.7329 4.4835 3.6029 4.0742 3.9589 3.9645 3.7589 3.9160 4.0050 3.7017 4.0092 3.9127 3.8843 3.8925 3.9047 1.0287 1.0279 1.0000 1.0135 1.0008 1.0053 1.0024 1.0014 1.0293 1.0192 1.0066 1.0121 0.9893 1.0047 1.0076 0.9965 0.9892 0.9900 0.9905
dispcorr: -0.024535334 hartree
energy: -1928.212166254920
dipole: 41.78930 -40.49326 1.29604 -21.23517 21.19999 -0.03518 1.70440 -2.92226 -1.21786
magnitude: 1.77881 au
magnitude: 4.52137 debye
