program: Orca
programVersion: 5.0.2
elementType: Cl F F F O O O N C C C C C C C C C C C C C C C C C C C C C C C H H H H H H H H H H H H H H H H H H H
charge: 0
multiplicity: 1
keywords: wb97x-d3
keywords: def2-TZVPP
keywords: def2/J RIJCOSX
keywords: DEFGRID2
keywords: scfconv7
keywords: smallprint printgap noloewdin
keywords: NOSOSCF
formula: C23H19ClF3NO3
InChI: InChI=1/C23H19ClF3NO3/c1-22(2)17(12-19(24)23(25,26)27)20(22)21(29)31-18(13-28)14-7-6-10-16(11-14)30-15-8-4-3-5-9-15/h3-12,17-18,20H,1-2H3
50 atoms
Cl -3.116033 2.881947 1.867246
F  -3.270168 -0.067691 1.762715
F  -2.768508 -0.304758 -0.319781
F  -4.562593 0.741077 0.252035
O  2.289227 1.962429 0.594712
O  1.308049 1.277234 -1.284687
O  0.039521 -3.388377 0.022507
N  4.398771 -0.12548 -1.106042
C  -0.135034 4.003853 -1.389829
C  -0.782514 3.411898 -0.165302
C  0.746307 3.414619 -0.328404
C  -0.302673 3.381202 -2.75486
C  -0.124091 5.514634 -1.443956
C  -1.526016 2.15242 -0.193824
C  1.445644 2.12325 -0.440971
C  -2.524328 1.836097 0.624496
C  2.800259 0.653898 0.810257
C  -3.277713 0.543682 0.573067
C  1.695837 -0.323873 1.150442
C  3.661479 0.221832 -0.296842
C  1.424843 -1.443879 0.378961
C  0.926127 -0.038707 2.273717
C  0.386726 -2.291298 0.750458
C  -0.121942 -0.877473 2.614277
C  -0.394173 -2.009058 1.861957
C  0.981303 -4.085596 -0.687432
C  2.185022 -4.4820 -0.117209
C  0.659488 -4.443147 -1.987719
C  3.072212 -5.23735 -0.869683
C  1.550628 -5.211329 -2.72381
C  2.761199 -5.605441 -2.172095
H  -1.122497 4.130234 0.570433
H  1.243638 4.118841 0.328463
H  -1.180402 3.815019 -3.236889
H  0.561822 3.61159 -3.379364
H  -0.428563 2.303431 -2.756443
H  0.688523 5.869422 -2.080405
H  -1.0616 5.888325 -1.85845
H  0.00643 5.960886 -0.457102
H  -1.250611 1.409743 -0.931854
H  3.457912 0.764457 1.676621
H  2.00817 -1.655393 -0.508778
H  1.138032 0.83243 2.880581
H  -0.724266 -0.659744 3.485993
H  -1.205474 -2.67238 2.13364
H  2.430477 -4.212066 0.902435
H  -0.283769 -4.128665 -2.416071
H  4.011263 -5.545244 -0.428233
H  1.296877 -5.49531 -3.736822
H  3.456832 -6.19856 -2.750828
elementType: Cl F O N C H
totalener: -1928.18384965 hartree
nucrepener: 3319.84902769 hartree
electener: -5248.03287734 hartree
oneelecener: -9247.83989606 hartree
twoeener: 3999.80701872 hartree
cpcmener: -0.03272497 hartree
kineticenergy: 1921.61597579 hartree
xcener: -157.116031480367 hartree
chargesum: 0.0000000
charge: -0.070993 -0.174894 -0.174457 -0.173642 -0.284130 -0.425128 -0.324846 -0.078964 0.090775 0.026175 -0.055358 -0.263825 -0.258248 -0.168551 0.374161 -0.088695 0.484473 0.534435 -0.035706 -0.258944 -0.147824 -0.261682 0.278873 -0.119110 -0.255163 0.271448 -0.186482 -0.240077 -0.141525 -0.123905 -0.178570 0.093535 0.104442 0.097266 0.103378 0.095259 0.097999 0.098647 0.090277 0.149197 0.147209 0.135390 0.141406 0.156551 0.144878 0.155889 0.145510 0.158728 0.157157 0.157663
qa: -0.0710 -0.1749 -0.1745 -0.1736 -0.2841 -0.4251 -0.3248 -0.0790 0.0908 0.0262 -0.0554 -0.2638 -0.2582 -0.1686 0.3742 -0.0887 0.4845 0.5344 -0.0357 -0.2589 -0.1478 -0.2617 0.2789 -0.1191 -0.2552 0.2714 -0.1865 -0.2401 -0.1415 -0.1239 -0.1786 0.0935 0.1044 0.0973 0.1034 0.0953 0.0980 0.0986 0.0903 0.1492 0.1472 0.1354 0.1414 0.1566 0.1449 0.1559 0.1455 0.1587 0.1572 0.1577
va: 1.2642 1.1203 1.1278 1.1279 2.1297 2.0770 2.0832 3.1085 3.8077 3.8038 3.8702 3.8900 3.9042 3.8528 4.1229 4.0046 3.8390 4.4433 3.6835 4.0833 3.8598 3.9438 3.7749 3.8505 3.9690 3.7035 3.9186 4.0126 3.8892 3.8852 3.9030 1.0285 1.0270 1.0013 0.9999 1.0153 1.0020 1.0021 1.0047 1.0200 0.9915 1.0203 1.0098 0.9914 1.0079 0.9970 1.0080 0.9902 0.9896 0.9905
dispcorr: -0.028467011 hartree
energy: -1928.212316662547
dipole: 26.24161 -26.03081 0.21080 3.18764 -1.36586 1.82178 -16.03507 17.15389 1.11882
magnitude: 2.14828 au
magnitude: 5.46048 debye
