program: Orca
programVersion: 5.0.2
elementType: Cl F F F O O O N C C C C C C C C C C C C C C C C C C C C C C C H H H H H H H H H H H H H H H H H H H
charge: 0
multiplicity: 1
keywords: wb97x-d3
keywords: def2-TZVPP
keywords: def2/J RIJCOSX
keywords: DEFGRID2
keywords: scfconv7
keywords: smallprint printgap noloewdin
keywords: NOSOSCF
formula: C23H19ClF3NO3
InChI: InChI=1/C23H19ClF3NO3/c1-22(2)17(12-19(24)23(25,26)27)20(22)21(29)31-18(13-28)14-7-6-10-16(11-14)30-15-8-4-3-5-9-15/h3-12,17-18,20H,1-2H3
50 atoms
Cl -4.70667 2.591336 -1.091453
F  -2.336043 3.521087 -4.019837
F  -4.245635 4.352048 -3.48466
F  -4.091196 2.274927 -4.008892
O  1.116492 0.283823 0.33175
O  0.540794 1.393687 -1.515438
O  2.833716 -3.636373 3.235341
N  1.168502 -2.084228 -2.103542
C  -0.645666 3.285797 0.802969
C  -1.782644 2.633119 0.06205
C  -0.61633 1.792471 0.559166
C  0.314468 4.206779 0.093821
C  -0.924549 3.704362 2.22586
C  -2.030938 2.903005 -1.356442
C  0.370285 1.174518 -0.344167
C  -3.231017 2.928957 -1.927799
C  2.153726 -0.371963 -0.38505
C  -3.468521 3.269145 -3.365636
C  3.029965 -1.097891 0.603693
C  1.579423 -1.320013 -1.350211
C  2.479984 -2.061286 1.443277
C  4.381381 -0.792038 0.663922
C  3.30445 -2.723147 2.341178
C  5.192385 -1.46138 1.570356
C  4.662376 -2.428703 2.405567
C  1.836236 -4.510821 2.895519
C  0.881571 -4.779802 3.866105
C  1.806736 -5.162665 1.668607
C  -0.10957 -5.715664 3.607226
C  0.801789 -6.087012 1.420029
C  -0.157912 -6.368763 2.383388
H  -2.676442 2.476477 0.654273
H  -0.841121 1.185565 1.428756
H  -0.106712 5.212132 0.047016
H  1.249931 4.268812 0.652644
H  0.563546 3.910077 -0.922191
H  -1.346197 4.71076 2.252041
H  -1.62988 3.034383 2.718424
H  -0.004528 3.712021 2.813468
H  -1.187659 3.135226 -1.991174
H  2.754096 0.347133 -0.950314
H  1.421115 -2.289265 1.396094
H  4.8002 -0.038766 0.008804
H  6.248358 -1.231462 1.621492
H  5.293337 -2.956086 3.109917
H  0.921932 -4.26602 4.818552
H  2.558118 -4.964487 0.91404
H  -0.850114 -5.928594 4.367544
H  0.777825 -6.596173 0.465124
H  -0.934099 -7.095477 2.182856
elementType: Cl F O N C H
totalener: -1928.18828757 hartree
nucrepener: 3063.40793297 hartree
electener: -4991.59622054 hartree
oneelecener: -8734.18094505 hartree
twoeener: 3742.58472451 hartree
cpcmener: -0.03372418 hartree
kineticenergy: 1921.59073443 hartree
xcener: -157.108369997540 hartree
chargesum: 0.0000000
charge: -0.073702 -0.170655 -0.174433 -0.173539 -0.280378 -0.439780 -0.326389 -0.087535 0.068625 0.036584 -0.066899 -0.263919 -0.252890 -0.159201 0.394531 -0.082141 0.432394 0.510077 0.001593 -0.237562 -0.196395 -0.180398 0.231536 -0.123810 -0.222140 0.283321 -0.249726 -0.193493 -0.118388 -0.139893 -0.186098 0.093811 0.106339 0.106475 0.103300 0.095173 0.098164 0.090185 0.097370 0.142726 0.126259 0.149164 0.147232 0.159174 0.148814 0.146063 0.155777 0.157580 0.159365 0.157733
qa: -0.0737 -0.1707 -0.1744 -0.1735 -0.2804 -0.4398 -0.3264 -0.0875 0.0686 0.0366 -0.0669 -0.2639 -0.2529 -0.1592 0.3945 -0.0821 0.4324 0.5101 0.0016 -0.2376 -0.1964 -0.1804 0.2315 -0.1238 -0.2221 0.2833 -0.2497 -0.1935 -0.1184 -0.1399 -0.1861 0.0938 0.1063 0.1065 0.1033 0.0952 0.0982 0.0902 0.0974 0.1427 0.1263 0.1492 0.1472 0.1592 0.1488 0.1461 0.1558 0.1576 0.1594 0.1577
va: 1.2616 1.1335 1.1234 1.1260 2.1712 2.0580 2.0819 3.1107 3.8243 3.7764 3.8893 3.8995 3.9052 3.8590 4.1284 4.0081 3.7308 4.4844 3.7287 4.0168 3.9599 3.9338 3.7860 3.9156 4.0063 3.6904 4.0111 3.9131 3.8837 3.8909 3.9073 1.0287 1.0240 0.9996 0.9999 1.0147 1.0014 1.0056 1.0022 1.0280 1.0233 1.0136 1.0020 0.9900 1.0049 1.0081 0.9979 0.9891 0.9901 0.9907
dispcorr: -0.023794218 hartree
energy: -1928.212081790763
dipole: 33.03728 -31.22144 1.81584 -15.86381 16.82009 0.95629 35.83432 -32.86731 2.96701
magnitude: 3.60762 au
magnitude: 9.16984 debye
