program: Orca
programVersion: 5.0.2
elementType: Cl F F F O O O N C C C C C C C C C C C C C C C C C C C C C C C H H H H H H H H H H H H H H H H H H H
charge: 0
multiplicity: 1
keywords: wb97x-d3
keywords: def2-TZVPP
keywords: def2/J RIJCOSX
keywords: DEFGRID2
keywords: scfconv7
keywords: smallprint printgap noloewdin
keywords: NOSOSCF
formula: C23H19ClF3NO3
InChI: InChI=1/C23H19ClF3NO3/c1-22(2)17(12-19(24)23(25,26)27)20(22)21(29)31-18(13-28)14-7-6-10-16(11-14)30-15-8-4-3-5-9-15/h3-12,17-18,20H,1-2H3
50 atoms
Cl -2.965603 0.337846 0.867576
F  -1.995421 -1.357487 -1.367777
F  -1.341455 0.238673 -2.654629
F  -3.42562 0.035992 -2.153537
O  1.676743 1.996205 -0.218918
O  2.443233 2.272641 1.856344
O  0.63797 -3.05131 -0.430718
N  2.993419 1.371011 -3.170416
C  -0.396394 4.145252 0.512159
C  -1.043967 2.800657 0.66123
C  0.289045 3.090248 1.35375
C  0.166465 4.605994 -0.810177
C  -1.023864 5.273781 1.296801
C  -1.180249 1.867342 -0.460931
C  1.567842 2.425576 1.042923
C  -1.988404 0.812592 -0.473964
C  2.859793 1.280688 -0.562873
C  -2.183324 -0.068847 -1.667177
C  2.800592 -0.148524 -0.082481
C  2.924553 1.340571 -2.024661
C  1.735619 -0.954995 -0.470963
C  3.777376 -0.639927 0.769591
C  1.664326 -2.253425 -0.001675
C  3.693449 -1.947955 1.229306
C  2.63655 -2.759434 0.8524
C  -0.352884 -3.38837 0.447201
C  -1.133363 -4.485412 0.100595
C  -0.613948 -2.675224 1.610397
C  -2.181607 -4.865573 0.922885
C  -1.665724 -3.073522 2.425993
C  -2.453002 -4.165111 2.091858
H  -1.859784 2.759295 1.37418
H  0.197339 3.237125 2.423442
H  0.619725 3.827674 -1.417502
H  -0.629432 5.05954 -1.403507
H  0.926909 5.370799 -0.644302
H  -1.844117 5.719225 0.731038
H  -1.424198 4.935677 2.253128
H  -0.292484 6.058217 1.498722
H  -0.626901 2.066966 -1.368347
H  3.752191 1.779801 -0.17229
H  0.966255 -0.584377 -1.13823
H  4.602381 -0.008636 1.074193
H  4.456656 -2.336195 1.890633
H  2.570305 -3.779283 1.210953
H  -0.920251 -5.031667 -0.810036
H  -0.023418 -1.810771 1.885644
H  -2.787338 -5.719412 0.647348
H  -1.869109 -2.51373 3.330017
H  -3.270895 -4.466476 2.732904
elementType: Cl F O N C H
totalener: -1928.18398564 hartree
nucrepener: 3411.52629354 hartree
electener: -5339.71027918 hartree
oneelecener: -9430.42988567 hartree
twoeener: 4090.71960649 hartree
cpcmener: -0.03453873 hartree
kineticenergy: 1921.61772213 hartree
xcener: -157.114050058599 hartree
chargesum: -0.0000000
charge: -0.073411 -0.166602 -0.175270 -0.172842 -0.271889 -0.435077 -0.325065 -0.082145 0.084884 0.010507 -0.104144 -0.268249 -0.256604 -0.136873 0.417353 -0.078353 0.362686 0.525152 0.015021 -0.227733 -0.198189 -0.155654 0.172726 -0.134268 -0.144140 0.289434 -0.238383 -0.186193 -0.124159 -0.177218 -0.180218 0.099557 0.103394 0.093023 0.104608 0.103376 0.097656 0.090551 0.097925 0.137949 0.142870 0.141876 0.146116 0.160751 0.157465 0.143174 0.145414 0.155737 0.156462 0.157014
qa: -0.0734 -0.1666 -0.1753 -0.1728 -0.2719 -0.4351 -0.3251 -0.0821 0.0849 0.0105 -0.1041 -0.2682 -0.2566 -0.1369 0.4174 -0.0784 0.3627 0.5252 0.0150 -0.2277 -0.1982 -0.1557 0.1727 -0.1343 -0.1441 0.2894 -0.2384 -0.1862 -0.1242 -0.1772 -0.1802 0.0996 0.1034 0.0930 0.1046 0.1034 0.0977 0.0906 0.0979 0.1379 0.1429 0.1419 0.1461 0.1608 0.1575 0.1432 0.1454 0.1557 0.1565 0.1570
va: 1.2590 1.1225 1.1246 1.1291 2.1279 2.0785 2.0500 3.1054 3.8211 3.7665 3.8939 3.9059 3.9042 3.8411 4.1396 3.9545 3.7926 4.4498 3.5808 4.0617 4.0197 3.9362 3.8737 3.8947 3.9590 3.5937 3.9952 3.8297 3.9020 3.9041 3.8933 1.0266 1.0245 1.0094 0.9990 1.0008 1.0017 1.0054 1.0021 1.0220 1.0151 1.0214 1.0042 0.9894 0.9955 1.0097 1.0082 0.9891 0.9919 0.9898
dispcorr: -0.030628782 hartree
energy: -1928.214614422862
dipole: 13.27367 -13.21237 0.06130 14.25941 -12.82099 1.43841 17.54671 -15.57369 1.97302
magnitude: 2.44246 au
magnitude: 6.20824 debye
