program: Orca
programVersion: 5.0.2
elementType: Cl F F F O O O N C C C C C C C C C C C C C C C C C C C C C C C H H H H H H H H H H H H H H H H H H H
charge: 0
multiplicity: 1
keywords: wb97x-d3
keywords: def2-TZVPP
keywords: def2/J RIJCOSX
keywords: DEFGRID2
keywords: scfconv7
keywords: smallprint printgap noloewdin
keywords: NOSOSCF
formula: C23H19ClF3NO3
InChI: InChI=1/C23H19ClF3NO3/c1-22(2)17(12-19(24)23(25,26)27)20(22)21(29)31-18(13-28)14-7-6-10-16(11-14)30-15-8-4-3-5-9-15/h3-12,17-18,20H,1-2H3
50 atoms
Cl -4.501831 3.753054 -2.007753
F  -3.552292 3.516659 -4.808454
F  -1.494746 4.035496 -4.444597
F  -3.054487 5.472546 -4.082541
O  0.647976 0.215457 0.203934
O  0.624914 1.548555 -1.581227
O  0.998743 -4.002422 2.889952
N  1.221451 -1.807389 -2.460882
C  -0.938274 3.317699 0.591418
C  -1.934343 2.846835 -0.436569
C  -0.972942 1.856237 0.197668
C  0.217458 4.201287 0.191352
C  -1.479961 3.634437 1.963352
C  -1.84429 3.275912 -1.833754
C  0.153933 1.233189 -0.518941
C  -2.86892 3.687916 -2.572722
C  1.797851 -0.446053 -0.301193
C  -2.736028 4.176178 -3.981043
C  2.302783 -1.391046 0.759881
C  1.458301 -1.191358 -1.520908
C  1.435111 -2.304089 1.345823
C  3.640532 -1.354678 1.125054
C  1.912794 -3.174414 2.314404
C  4.10603 -2.238564 2.08867
C  3.252267 -3.147514 2.691579
C  1.399678 -5.213312 3.396708
C  2.028524 -6.152356 2.58947
C  1.103583 -5.494905 4.720929
C  2.360951 -7.388113 3.124178
C  1.434069 -6.739192 5.241136
C  2.065653 -7.686748 4.44838
H  -2.944504 2.730738 -0.062002
H  -1.429275 1.200164 0.93004
H  1.02423 4.113415 0.92098
H  0.637044 3.983216 -0.787526
H  -0.104911 5.24376 0.182468
H  -1.809668 4.673828 2.013238
H  -2.328579 3.001771 2.225289
H  -0.709256 3.491951 2.723228
H  -0.872291 3.286747 -2.305719
H  2.581119 0.272769 -0.559387
H  0.390729 -2.34893 1.059249
H  4.314032 -0.64305 0.664669
H  5.146705 -2.213719 2.383522
H  3.631046 -3.818584 3.451849
H  2.250154 -5.927245 1.553276
H  0.613844 -4.750251 5.335901
H  2.84731 -8.124096 2.497061
H  1.200136 -6.962909 6.273961
H  2.323184 -8.654806 4.8576
elementType: Cl F O N C H
totalener: -1928.18799020 hartree
nucrepener: 3000.07157920 hartree
electener: -4928.25956941 hartree
oneelecener: -8607.42952822 hartree
twoeener: 3679.16995882 hartree
cpcmener: -0.03378156 hartree
kineticenergy: 1921.61328193 hartree
xcener: -157.112480657598 hartree
chargesum: -0.0000000
charge: -0.073646 -0.173268 -0.170572 -0.174617 -0.278886 -0.442533 -0.325486 -0.086973 0.073104 0.034399 -0.080670 -0.262411 -0.253802 -0.159499 0.402891 -0.085502 0.423115 0.510668 -0.003348 -0.238784 -0.216306 -0.181146 0.216259 -0.149575 -0.159049 0.234324 -0.164044 -0.216677 -0.152336 -0.135463 -0.166056 0.094964 0.108315 0.105059 0.094583 0.105782 0.097526 0.090808 0.097507 0.147655 0.129007 0.136872 0.147540 0.160191 0.156829 0.159305 0.147573 0.159789 0.157528 0.159055
qa: -0.0736 -0.1733 -0.1706 -0.1746 -0.2789 -0.4425 -0.3255 -0.0870 0.0731 0.0344 -0.0807 -0.2624 -0.2538 -0.1595 0.4029 -0.0855 0.4231 0.5107 -0.0033 -0.2388 -0.2163 -0.1811 0.2163 -0.1496 -0.1590 0.2343 -0.1640 -0.2167 -0.1523 -0.1355 -0.1661 0.0950 0.1083 0.1051 0.0946 0.1058 0.0975 0.0908 0.0975 0.1477 0.1290 0.1369 0.1475 0.1602 0.1568 0.1593 0.1476 0.1598 0.1575 0.1591
va: 1.2610 1.1276 1.1331 1.1220 2.1684 2.0540 2.0722 3.1129 3.8113 3.7807 3.9228 3.9022 3.9090 3.8469 4.1141 4.0080 3.7324 4.4833 3.7573 4.0185 4.0678 3.9436 3.8257 3.9305 3.8873 3.7253 3.9213 3.9968 3.8925 3.8902 3.8912 1.0282 1.0231 0.9998 1.0134 1.0002 1.0018 1.0055 1.0019 1.0307 1.0212 1.0280 1.0022 0.9917 0.9967 0.9953 1.0058 0.9901 0.9897 0.9898
dispcorr: -0.023487092 hartree
energy: -1928.211477293909
dipole: 30.17708 -28.49373 1.68335 -27.86269 27.77359 -0.08910 46.15296 -42.17964 3.97332
magnitude: 4.31612 au
magnitude: 10.97070 debye
