program: Orca
programVersion: 5.0.2
elementType: Cl F F F O O O N C C C C C C C C C C C C C C C C C C C C C C C H H H H H H H H H H H H H H H H H H H
charge: 0
multiplicity: 1
keywords: wb97x-d3
keywords: def2-TZVPP
keywords: def2/J RIJCOSX
keywords: DEFGRID2
keywords: scfconv7
keywords: smallprint printgap noloewdin
keywords: NOSOSCF
formula: C23H19ClF3NO3
InChI: InChI=1/C23H19ClF3NO3/c1-22(2)17(12-19(24)23(25,26)27)20(22)21(29)31-18(13-28)14-7-6-10-16(11-14)30-15-8-4-3-5-9-15/h3-12,17-18,20H,1-2H3
50 atoms
Cl -4.433356 3.590399 -2.312964
F  -3.057848 3.779728 -4.975118
F  -1.221488 4.620378 -4.229107
F  -3.076193 5.68639 -3.994638
O  0.574239 0.194674 0.16468
O  0.643687 1.633764 -1.538481
O  0.989641 -4.011927 2.867152
N  1.28171 -1.755461 -2.505846
C  -1.091504 3.223041 0.665391
C  -1.983963 2.851401 -0.490053
C  -1.079228 1.804365 0.137629
C  0.09536 4.129352 0.457943
C  -1.766712 3.426022 1.999056
C  -1.777446 3.425422 -1.821411
C  0.1099 1.248108 -0.531293
C  -2.749128 3.798533 -2.648211
C  1.761592 -0.422603 -0.305152
C  -2.518292 4.470049 -3.965028
C  2.2667 -1.371241 0.754321
C  1.485536 -1.154209 -1.548537
C  1.407238 -2.294966 1.335976
C  3.606194 -1.331173 1.113996
C  1.894553 -3.168564 2.297486
C  4.080114 -2.215794 2.072423
C  3.233478 -3.131196 2.675108
C  1.400068 -5.22448 3.360675
C  1.020662 -5.558012 4.651482
C  2.12195 -6.115708 2.576924
C  1.367428 -6.801516 5.162871
C  2.471605 -7.349676 3.104448
C  2.098327 -7.697648 4.396258
H  -3.02218 2.697473 -0.221428
H  -1.597864 1.083289 0.758965
H  0.810696 3.99538 1.2713
H  0.632785 3.968779 -0.473976
H  -0.227242 5.171772 0.472567
H  -2.134269 4.450221 2.086995
H  -2.614472 2.754218 2.135106
H  -1.065819 3.251929 2.817555
H  -0.764482 3.607607 -2.151647
H  2.532154 0.322003 -0.525385
H  0.362511 -2.346929 1.052229
H  4.275193 -0.615479 0.653274
H  5.121797 -2.186635 2.36345
H  3.618594 -3.800948 3.433281
H  0.455315 -4.853211 5.248423
H  2.406971 -5.855902 1.564762
H  1.069338 -7.063456 6.169875
H  3.035351 -8.045218 2.496182
H  2.372704 -8.663236 4.800244
elementType: Cl F O N C H
totalener: -1928.18798127 hartree
nucrepener: 2998.37515692 hartree
electener: -4926.56313819 hartree
oneelecener: -8603.98380383 hartree
twoeener: 3677.42066564 hartree
cpcmener: -0.03388630 hartree
kineticenergy: 1921.60191203 hartree
xcener: -157.110610318491 hartree
chargesum: 0.0000000
charge: -0.074383 -0.173614 -0.170471 -0.174327 -0.279617 -0.438407 -0.325270 -0.087355 0.073076 0.038923 -0.075685 -0.264954 -0.254375 -0.156943 0.395156 -0.083519 0.419259 0.510455 0.001014 -0.237664 -0.221224 -0.182435 0.227321 -0.146911 -0.166230 0.250840 -0.224547 -0.176004 -0.131696 -0.147693 -0.171512 0.093481 0.109395 0.103832 0.095365 0.106698 0.098750 0.090814 0.096550 0.142139 0.128303 0.137142 0.147263 0.160273 0.157347 0.146790 0.159180 0.157574 0.159165 0.158728
qa: -0.0744 -0.1736 -0.1705 -0.1743 -0.2796 -0.4384 -0.3253 -0.0874 0.0731 0.0389 -0.0757 -0.2650 -0.2544 -0.1569 0.3952 -0.0835 0.4193 0.5105 0.0010 -0.2377 -0.2212 -0.1824 0.2273 -0.1469 -0.1662 0.2508 -0.2245 -0.1760 -0.1317 -0.1477 -0.1715 0.0935 0.1094 0.1038 0.0954 0.1067 0.0988 0.0908 0.0966 0.1421 0.1283 0.1371 0.1473 0.1603 0.1573 0.1468 0.1592 0.1576 0.1592 0.1587
va: 1.2606 1.1265 1.1333 1.1232 2.1651 2.0602 2.0763 3.1126 3.8169 3.7758 3.9016 3.9005 3.9063 3.8573 4.1299 4.0058 3.7304 4.4850 3.7580 4.0184 4.0707 3.9499 3.8179 3.9274 3.8939 3.7117 4.0019 3.9188 3.8890 3.8903 3.8960 1.0294 1.0226 1.0005 1.0149 0.9992 1.0011 1.0055 1.0025 1.0293 1.0231 1.0279 1.0021 0.9917 0.9959 1.0064 0.9953 0.9896 0.9903 0.9900
dispcorr: -0.023446089 hartree
energy: -1928.211427363155
dipole: 27.69751 -26.21832 1.47919 -29.82166 29.64219 -0.17947 47.31791 -43.29911 4.01880
magnitude: 4.28613 au
magnitude: 10.89449 debye
