program: Orca
programVersion: 5.0.2
elementType: Cl F F F O O O N C C C C C C C C C C C C C C C C C C C C C C C H H H H H H H H H H H H H H H H H H H
charge: 0
multiplicity: 1
keywords: wb97x-d3
keywords: def2-TZVPP
keywords: def2/J RIJCOSX
keywords: DEFGRID2
keywords: scfconv7
keywords: smallprint printgap noloewdin
keywords: NOSOSCF
formula: C23H19ClF3NO3
InChI: InChI=1/C23H19ClF3NO3/c1-22(2)17(12-19(24)23(25,26)27)20(22)21(29)31-18(13-28)14-7-6-10-16(11-14)30-15-8-4-3-5-9-15/h3-12,17-18,20H,1-2H3
50 atoms
Cl -2.489447 2.498806 2.856679
F  -3.980301 0.056094 1.741022
F  -2.281428 -0.43328 2.957466
F  -2.223824 -0.802224 0.836563
O  2.45547 2.07843 -0.061894
O  0.997363 1.2170 -1.50923
O  0.763562 -3.509146 0.136508
N  4.090053 0.148033 -2.354384
C  -0.725407 3.740138 -1.122028
C  -0.845531 3.136863 0.254154
C  0.526549 3.309167 -0.417253
C  -1.263788 3.033545 -2.343299
C  -0.924308 5.237519 -1.187578
C  -1.394604 1.800452 0.485426
C  1.302633 2.103422 -0.756346
C  -2.091308 1.43276 1.555992
C  3.145301 0.835602 -0.014832
C  -2.641574 0.056209 1.766394
C  2.305467 -0.228574 0.660685
C  3.639591 0.449697 -1.34189
C  1.955361 -1.412274 0.029511
C  1.854955 0.04194 1.949061
C  1.12643 -2.31562 0.685058
C  1.03972 -0.873643 2.593788
C  0.662542 -2.050066 1.964887
C  0.568011 -3.639489 -1.212545
C  -0.082329 -2.672263 -1.969705
C  0.994696 -4.825116 -1.79353
C  -0.287307 -2.899106 -3.323062
C  0.769128 -5.043938 -3.144857
C  0.135378 -4.080773 -3.917091
H  -1.009827 3.846064 1.056082
H  1.122871 4.097298 0.028196
H  -0.693877 3.32465 -3.226887
H  -1.251933 1.949809 -2.288509
H  -2.297827 3.342747 -2.503835
H  -0.419444 5.652719 -2.061769
H  -1.985286 5.479612 -1.267314
H  -0.531792 5.743534 -0.304558
H  -1.223359 1.038865 -0.26489
H  4.029646 1.043009 0.593227
H  2.314028 -1.630215 -0.968742
H  2.131215 0.962019 2.448346
H  0.687551 -0.667203 3.595533
H  0.016861 -2.761537 2.46369
H  -0.429368 -1.750818 -1.519307
H  1.493951 -5.572343 -1.18942
H  -0.788301 -2.143445 -3.914187
H  1.100241 -5.971053 -3.594656
H  -0.030738 -4.25029 -4.972767
elementType: Cl F O N C H
totalener: -1928.18306136 hartree
nucrepener: 3379.18603782 hartree
electener: -5307.36909918 hartree
oneelecener: -9366.09997016 hartree
twoeener: 4058.73087098 hartree
cpcmener: -0.03226903 hartree
kineticenergy: 1921.60912180 hartree
xcener: -157.115691188221 hartree
chargesum: -0.0000000
charge: -0.069853 -0.173349 -0.176261 -0.171293 -0.285295 -0.427271 -0.324218 -0.078087 0.090553 0.029107 -0.050517 -0.266080 -0.257068 -0.168041 0.368972 -0.095073 0.492297 0.535102 -0.020615 -0.262312 -0.187789 -0.267920 0.302009 -0.111563 -0.258668 0.273178 -0.174762 -0.238897 -0.161058 -0.127325 -0.174452 0.094373 0.105348 0.104545 0.095500 0.097719 0.097849 0.098873 0.090282 0.150135 0.145279 0.138940 0.141525 0.156559 0.146337 0.158149 0.144424 0.156474 0.157258 0.156980
qa: -0.0699 -0.1733 -0.1763 -0.1713 -0.2853 -0.4273 -0.3242 -0.0781 0.0906 0.0291 -0.0505 -0.2661 -0.2571 -0.1680 0.3690 -0.0951 0.4923 0.5351 -0.0206 -0.2623 -0.1878 -0.2679 0.3020 -0.1116 -0.2587 0.2732 -0.1748 -0.2389 -0.1611 -0.1273 -0.1745 0.0944 0.1053 0.1045 0.0955 0.0977 0.0978 0.0989 0.0903 0.1501 0.1453 0.1389 0.1415 0.1566 0.1463 0.1581 0.1444 0.1565 0.1573 0.1570
va: 1.2665 1.1278 1.1200 1.1263 2.1280 2.0689 2.0919 3.1075 3.7996 3.8018 3.8699 3.8936 3.9045 3.8620 4.1194 4.0128 3.8371 4.4438 3.6685 4.0912 3.8838 3.9444 3.7556 3.8401 3.9566 3.7090 3.8902 4.0015 3.9181 3.8885 3.8999 1.0263 1.0262 0.9995 1.0129 1.0015 1.0020 1.0021 1.0049 1.0026 0.9918 1.0138 1.0108 0.9932 1.0079 0.9897 1.0086 0.9922 0.9892 0.9905
dispcorr: -0.030067931 hartree
energy: -1928.213129291682
dipole: 13.54151 -13.61185 -0.07034 8.18659 -6.02904 2.15755 -25.94031 26.80964 0.86934
magnitude: 2.32717 au
magnitude: 5.91519 debye
