program: Orca
programVersion: 5.0.2
elementType: Cl F F F O O O N C C C C C C C C C C C C C C C C C C C C C C C H H H H H H H H H H H H H H H H H H H
charge: 0
multiplicity: 1
keywords: wb97x-d3
keywords: def2-TZVPP
keywords: def2/J RIJCOSX
keywords: DEFGRID2
keywords: scfconv7
keywords: smallprint printgap noloewdin
keywords: NOSOSCF
formula: C23H19ClF3NO3
InChI: InChI=1/C23H19ClF3NO3/c1-22(2)17(12-19(24)23(25,26)27)20(22)21(29)31-18(13-28)14-7-6-10-16(11-14)30-15-8-4-3-5-9-15/h3-12,17-18,20H,1-2H3
50 atoms
Cl -4.52501 3.272995 -1.771246
F  -1.762623 3.837139 -4.43486
F  -3.688556 4.772814 -4.21442
F  -3.561122 2.660044 -4.56471
O  0.827697 0.465631 0.265097
O  0.77298 1.811775 -1.510413
O  1.146659 -3.77918 2.929674
N  1.12111 -1.570987 -2.444231
C  -0.699792 3.691199 0.579567
C  -1.762232 3.082548 -0.292517
C  -0.70386 2.193774 0.353842
C  0.379375 4.567772 -0.003125
C  -1.14204 4.13491 1.952902
C  -1.819509 3.323118 -1.735832
C  0.349228 1.517625 -0.422462
C  -2.939189 3.429667 -2.443826
C  1.901237 -0.256147 -0.319848
C  -2.979989 3.677603 -3.918623
C  2.427213 -1.233965 0.700497
C  1.438693 -0.974769 -1.514554
C  1.555253 -2.100979 1.348307
C  3.787971 -1.275866 0.965382
C  2.054548 -2.998483 2.278911
C  4.273941 -2.186145 1.894291
C  3.416786 -3.045312 2.560345
C  1.465905 -5.069815 3.261363
C  2.061463 -5.932459 2.349542
C  1.113246 -5.508074 4.528935
C  2.308877 -7.244996 2.723828
C  1.357325 -6.826866 4.885584
C  1.959354 -7.698352 3.988942
H  -2.727845 2.969848 0.18537
H  -1.06913 1.606342 1.187775
H  0.013461 5.592547 -0.084907
H  1.245022 4.581194 0.661395
H  0.729224 4.267016 -0.987211
H  -1.538141 5.151397 1.915018
H  -1.919985 3.488925 2.361173
H  -0.302397 4.129518 2.650264
H  -0.889714 3.441145 -2.274486
H  2.704394 0.418879 -0.630781
H  0.491819 -2.087968 1.139059
H  4.465479 -0.602731 0.455622
H  5.33334 -2.219204 2.111343
H  3.808331 -3.737577 3.29498
H  2.325436 -5.592453 1.355642
H  0.647579 -4.823453 5.226861
H  2.772177 -7.918597 2.014517
H  1.07969 -7.169282 5.874066
H  2.152735 -8.724612 4.271876
elementType: Cl F O N C H
totalener: -1928.18839766 hartree
nucrepener: 3010.65478326 hartree
electener: -4938.84318092 hartree
oneelecener: -8628.70410327 hartree
twoeener: 3689.86092236 hartree
cpcmener: -0.03379328 hartree
kineticenergy: 1921.60538471 hartree
xcener: -157.111404253180 hartree
chargesum: -0.0000000
charge: -0.073510 -0.170219 -0.174109 -0.173379 -0.282572 -0.443593 -0.326902 -0.088223 0.069418 0.040971 -0.075426 -0.264490 -0.253097 -0.160623 0.402986 -0.084730 0.425953 0.510402 -0.002856 -0.239150 -0.214417 -0.177482 0.208937 -0.143311 -0.157779 0.256873 -0.172529 -0.234414 -0.150692 -0.127949 -0.175470 0.094792 0.106360 0.104278 0.102954 0.095943 0.098487 0.090639 0.097187 0.147469 0.129016 0.137982 0.147193 0.160484 0.158725 0.158041 0.146458 0.159604 0.157546 0.158223
qa: -0.0735 -0.1702 -0.1741 -0.1734 -0.2826 -0.4436 -0.3269 -0.0882 0.0694 0.0410 -0.0754 -0.2645 -0.2531 -0.1606 0.4030 -0.0847 0.4260 0.5104 -0.0029 -0.2391 -0.2144 -0.1775 0.2089 -0.1433 -0.1578 0.2569 -0.1725 -0.2344 -0.1507 -0.1279 -0.1755 0.0948 0.1064 0.1043 0.1030 0.0959 0.0985 0.0906 0.0972 0.1475 0.1290 0.1380 0.1472 0.1605 0.1587 0.1580 0.1465 0.1596 0.1575 0.1582
va: 1.2617 1.1339 1.1253 1.1249 2.1686 2.0516 2.0721 3.1125 3.8098 3.7717 3.9063 3.9012 3.9082 3.8565 4.1033 4.0113 3.7306 4.4845 3.7480 4.0197 4.0710 3.9455 3.8294 3.9194 3.9012 3.7086 3.9029 4.0016 3.8927 3.8906 3.8974 1.0287 1.0240 0.9997 0.9995 1.0142 1.0014 1.0054 1.0025 1.0288 1.0213 1.0270 1.0023 0.9914 0.9945 0.9961 1.0073 0.9904 0.9893 0.9903
dispcorr: -0.023368124 hartree
energy: -1928.211765783623
dipole: 33.04515 -31.08289 1.96226 -21.76327 22.06684 0.30356 43.61988 -39.89969 3.72019
magnitude: 4.21692 au
magnitude: 10.71855 debye
