program: Orca
programVersion: 5.0.2
elementType: Cl F F F O O O N C C C C C C C C C C C C C C C C C C C C C C C H H H H H H H H H H H H H H H H H H H
charge: 0
multiplicity: 1
keywords: wb97x-d3
keywords: def2-TZVPP
keywords: def2/J RIJCOSX
keywords: DEFGRID2
keywords: scfconv7
keywords: smallprint printgap noloewdin
keywords: NOSOSCF
formula: C23H19ClF3NO3
InChI: InChI=1/C23H19ClF3NO3/c1-22(2)17(12-19(24)23(25,26)27)20(22)21(29)31-18(13-28)14-7-6-10-16(11-14)30-15-8-4-3-5-9-15/h3-12,17-18,20H,1-2H3
50 atoms
Cl -2.1591 -0.064985 0.808759
F  -3.517152 -0.199174 -1.824326
F  -1.451977 -0.695951 -2.132939
F  -2.226026 1.171788 -2.868849
O  1.238013 1.637397 -0.320544
O  2.572858 2.293392 1.341808
O  1.170118 -3.100723 1.660236
N  1.468356 0.263728 -3.299413
C  -0.342319 4.154798 0.836666
C  -1.106858 2.868275 0.812819
C  0.285282 2.903503 1.418366
C  0.203762 4.736863 -0.443708
C  -0.7759 5.201196 1.832474
C  -1.431753 2.191152 -0.455539
C  1.482756 2.268845 0.832598
C  -1.931113 0.967422 -0.553404
C  2.31566 0.935494 -0.920407
C  -2.283524 0.314108 -1.85042
C  2.699321 -0.310028 -0.153499
C  1.827596 0.576415 -2.25435
C  1.704508 -1.129176 0.367271
C  4.039691 -0.621197 0.012485
C  2.069909 -2.274205 1.061914
C  4.388134 -1.771553 0.706121
C  3.411622 -2.600731 1.229351
C  -0.102291 -3.250381 1.173418
C  -0.357849 -3.451262 -0.176602
C  -1.131572 -3.273607 2.103237
C  -1.664325 -3.666851 -0.59125
C  -2.430864 -3.504844 1.675334
C  -2.703322 -3.696994 0.328414
H  -1.878348 2.761289 1.570047
H  0.32024 2.872383 2.501771
H  -0.559447 5.342154 -0.936493
H  1.05028 5.390177 -0.226184
H  0.545952 3.995931 -1.164551
H  -1.17212 4.755701 2.745629
H  0.059443 5.846411 2.10976
H  -1.556852 5.832806 1.404522
H  -1.293018 2.746903 -1.374963
H  3.188528 1.584147 -1.049063
H  0.659747 -0.872087 0.241305
H  4.805575 0.029099 -0.390544
H  5.431337 -2.023954 0.84281
H  3.682348 -3.495864 1.775164
H  0.447349 -3.447457 -0.9011
H  -0.913805 -3.120936 3.153087
H  -1.86531 -3.824849 -1.642896
H  -3.233186 -3.528389 2.401677
H  -3.71853 -3.870587 -0.003386
elementType: Cl F O N C H
totalener: -1928.18145196 hartree
nucrepener: 3468.06684934 hartree
electener: -5396.24830130 hartree
oneelecener: -9544.26867282 hartree
twoeener: 4148.02037152 hartree
cpcmener: -0.03431805 hartree
kineticenergy: 1921.64014531 hartree
xcener: -157.120494574300 hartree
chargesum: 0.0000000
charge: -0.078699 -0.178875 -0.172713 -0.174381 -0.258063 -0.426744 -0.324302 -0.083141 0.097465 -0.069086 -0.115856 -0.280421 -0.256859 -0.049924 0.401185 -0.092925 0.362064 0.534446 0.036692 -0.236605 -0.174392 -0.222081 0.288677 -0.099996 -0.248639 0.319986 -0.198734 -0.267561 -0.152887 -0.118488 -0.173586 0.117465 0.106178 0.108095 0.105965 0.086457 0.089873 0.097996 0.096082 0.151114 0.147777 0.090553 0.143372 0.158392 0.147551 0.154739 0.143018 0.157519 0.155475 0.156820
qa: -0.0787 -0.1789 -0.1727 -0.1744 -0.2581 -0.4267 -0.3243 -0.0831 0.0975 -0.0691 -0.1159 -0.2804 -0.2569 -0.0499 0.4012 -0.0929 0.3621 0.5344 0.0367 -0.2366 -0.1744 -0.2221 0.2887 -0.1000 -0.2486 0.3200 -0.1987 -0.2676 -0.1529 -0.1185 -0.1736 0.1175 0.1062 0.1081 0.1060 0.0865 0.0899 0.0980 0.0961 0.1511 0.1478 0.0906 0.1434 0.1584 0.1476 0.1547 0.1430 0.1575 0.1555 0.1568
va: 1.2721 1.1237 1.1136 1.1293 2.1199 2.0854 2.0941 3.0987 3.8390 3.8295 3.8974 3.9138 3.9003 3.7757 4.1382 3.9625 3.7633 4.4279 3.6113 4.0657 3.9555 3.9846 3.7252 3.8942 3.9937 3.6273 3.9006 3.9865 3.8517 3.8503 3.8799 1.0133 1.0245 0.9985 1.0015 1.0108 1.0049 1.0023 1.0015 1.0074 1.0122 1.0467 1.0030 0.9889 1.0067 0.9972 1.0095 0.9920 0.9895 0.9895
dispcorr: -0.032495069 hartree
energy: -1928.213947029556
dipole: 13.73121 -13.71507 0.01613 15.52923 -13.68727 1.84196 15.91507 -14.61432 1.30075
magnitude: 2.25500 au
magnitude: 5.73176 debye
