program: Orca
programVersion: 5.0.2
elementType: Cl F F F O O O N C C C C C C C C C C C C C C C C C C C C C C C H H H H H H H H H H H H H H H H H H H
charge: 0
multiplicity: 1
keywords: wb97x-d3
keywords: def2-TZVPP
keywords: def2/J RIJCOSX
keywords: DEFGRID2
keywords: scfconv7
keywords: smallprint printgap noloewdin
keywords: NOSOSCF
formula: C23H19ClF3NO3
InChI: InChI=1/C23H19ClF3NO3/c1-22(2)17(12-19(24)23(25,26)27)20(22)21(29)31-18(13-28)14-7-6-10-16(11-14)30-15-8-4-3-5-9-15/h3-12,17-18,20H,1-2H3
50 atoms
Cl -3.022763 0.980534 -1.097559
F  -2.685483 1.858188 -3.98673
F  -2.963524 3.95781 -3.590289
F  -4.539152 2.555453 -3.161459
O  1.031186 0.656175 0.285611
O  0.501879 1.973589 -1.43782
O  2.427144 -3.490197 2.979796
N  0.388119 -1.580169 -2.163229
C  -0.356721 3.924037 0.894961
C  -1.579775 3.280659 0.346033
C  -0.402895 2.408294 0.744978
C  0.531517 4.755568 0.005334
C  -0.413471 4.424588 2.317779
C  -2.00503 3.455604 -1.05837
C  0.393814 1.704265 -0.269392
C  -2.679531 2.543092 -1.742428
C  1.859793 -0.123295 -0.56331
C  -3.214157 2.734471 -3.126875
C  2.717772 -1.013908 0.298868
C  1.02203 -0.926212 -1.463375
C  2.124317 -1.867494 1.222718
C  4.097364 -0.962524 0.165644
C  2.931193 -2.673182 2.01282
C  4.890858 -1.77306 0.966231
C  4.315347 -2.631427 1.886545
C  1.254233 -4.169068 2.780679
C  0.973082 -4.819822 1.585706
C  0.377143 -4.241802 3.85293
C  -0.205796 -5.542463 1.47209
C  -0.792426 -4.978074 3.728012
C  -1.091684 -5.626578 2.538081
H  -2.418807 3.180908 1.030312
H  -0.525604 1.856147 1.668933
H  1.557505 4.745108 0.37729
H  0.553549 4.431517 -1.032566
H  0.190273 5.792363 0.016574
H  -0.804883 5.443135 2.347595
H  -1.054766 3.804146 2.944939
H  0.581543 4.43682 2.76595
H  -1.805148 4.409434 -1.532998
H  2.497837 0.512636 -1.183551
H  1.045802 -1.900139 1.327179
H  4.55122 -0.293405 -0.554302
H  5.967823 -1.738813 0.868618
H  4.931425 -3.266354 2.510776
H  1.66286 -4.77315 0.751919
H  0.613321 -3.732473 4.778998
H  -0.426248 -6.050117 0.541869
H  -1.473806 -5.038479 4.566962
H  -2.006289 -6.196865 2.442515
elementType: Cl F O N C H
totalener: -1928.18640526 hartree
nucrepener: 3166.06070478 hartree
electener: -5094.24711004 hartree
oneelecener: -8940.53421646 hartree
twoeener: 3846.28710642 hartree
cpcmener: -0.03535467 hartree
kineticenergy: 1921.61903568 hartree
xcener: -157.112515684096 hartree
chargesum: 0.0000000
charge: -0.068825 -0.170793 -0.170393 -0.173013 -0.281976 -0.434003 -0.328083 -0.086613 0.099741 -0.063746 -0.087660 -0.284053 -0.256689 -0.084724 0.373033 -0.065220 0.441186 0.504637 0.007000 -0.242122 -0.193175 -0.181521 0.223744 -0.123998 -0.218397 0.277105 -0.187683 -0.247184 -0.142367 -0.120763 -0.183617 0.126207 0.100699 0.103748 0.097297 0.103633 0.096585 0.089453 0.098147 0.150755 0.123788 0.148359 0.147150 0.158600 0.147602 0.156256 0.146513 0.160005 0.157557 0.157819
qa: -0.0688 -0.1708 -0.1704 -0.1730 -0.2820 -0.4340 -0.3281 -0.0866 0.0997 -0.0637 -0.0877 -0.2841 -0.2567 -0.0847 0.3730 -0.0652 0.4412 0.5046 0.0070 -0.2421 -0.1932 -0.1815 0.2237 -0.1240 -0.2184 0.2771 -0.1877 -0.2472 -0.1424 -0.1208 -0.1836 0.1262 0.1007 0.1037 0.0973 0.1036 0.0966 0.0895 0.0981 0.1508 0.1238 0.1484 0.1472 0.1586 0.1476 0.1563 0.1465 0.1600 0.1576 0.1578
va: 1.2691 1.1294 1.1346 1.1274 2.1668 2.0526 2.0790 3.1110 3.7806 3.8891 3.8808 3.9012 3.9046 3.7913 4.0985 3.9728 3.7199 4.4915 3.7241 4.0256 3.9556 3.9354 3.7890 3.9146 4.0043 3.6951 3.9119 4.0094 3.8922 3.8847 3.9067 1.0079 1.0281 1.0005 1.0122 0.9986 1.0018 1.0046 1.0021 1.0019 1.0259 1.0150 1.0018 0.9902 1.0052 0.9975 1.0078 0.9900 0.9892 0.9906
dispcorr: -0.025349228 hartree
energy: -1928.211754492953
dipole: 27.60712 -26.05269 1.55444 -4.36999 5.95014 1.58015 34.42315 -31.63404 2.78912
magnitude: 3.56263 au
magnitude: 9.05548 debye
