program: Orca
programVersion: 5.0.2
elementType: Cl F F F O O O N C C C C C C C C C C C C C C C C C C C C C C C H H H H H H H H H H H H H H H H H H H
charge: 0
multiplicity: 1
keywords: wb97x-d3
keywords: def2-TZVPP
keywords: def2/J RIJCOSX
keywords: DEFGRID2
keywords: scfconv7
keywords: smallprint printgap noloewdin
keywords: NOSOSCF
formula: C23H19ClF3NO3
InChI: InChI=1/C23H19ClF3NO3/c1-22(2)17(12-19(24)23(25,26)27)20(22)21(29)31-18(13-28)14-7-6-10-16(11-14)30-15-8-4-3-5-9-15/h3-12,17-18,20H,1-2H3
50 atoms
Cl -4.427059 3.050205 -1.601856
F  -3.620417 2.496403 -4.43276
F  -1.83908 3.702827 -4.416465
F  -3.763613 4.610286 -4.094733
O  0.978584 0.553371 0.299422
O  0.917414 1.871367 -1.497791
O  1.069972 -3.708113 2.937412
N  1.172128 -1.477558 -2.422479
C  -0.499778 3.833506 0.529088
C  -1.599166 3.163219 -0.246177
C  -0.49685 2.325997 0.39726
C  0.537582 4.683797 -0.160046
C  -0.872052 4.356032 1.895743
C  -1.736578 3.319253 -1.695853
C  0.515591 1.607649 -0.393705
C  -2.891552 3.306587 -2.354476
C  2.017476 -0.212557 -0.29211
C  -3.021413 3.528691 -3.82907
C  2.490927 -1.221682 0.723633
C  1.525529 -0.901152 -1.493436
C  1.571316 -2.048424 1.359794
C  3.845179 -1.332553 0.999711
C  2.018006 -2.973046 2.288855
C  4.278576 -2.272578 1.926003
C  3.374116 -3.092336 2.578422
C  1.280894 -5.040321 3.175033
C  1.827085 -5.881756 2.213484
C  0.867046 -5.537598 4.402198
C  1.963282 -7.232942 2.497481
C  0.999925 -6.892995 4.667558
C  1.551925 -7.744954 3.720875
H  -2.537047 3.069208 0.28776
H  -0.814082 1.78791 1.28251
H  0.160955 5.702535 -0.264272
H  1.442639 4.730351 0.447852
H  0.827179 4.339942 -1.149134
H  -1.282803 5.364424 1.818688
H  -1.617148 3.728614 2.385804
H  0.005306 4.401624 2.543544
H  -0.843564 3.487773 -2.281705
H  2.851064 0.427736 -0.596673
H  0.511646 -1.980461 1.142684
H  4.559506 -0.689846 0.501116
H  5.333127 -2.359527 2.151606
H  3.722794 -3.809718 3.310595
H  2.137431 -5.496674 1.249963
H  0.440331 -4.868918 5.139405
H  2.387959 -7.889731 1.749224
H  0.674563 -7.280803 5.624247
H  1.658811 -8.800481 3.933237
elementType: Cl F O N C H
totalener: -1928.18821601 hartree
nucrepener: 3017.64599286 hartree
electener: -4945.83420887 hartree
oneelecener: -8642.74162817 hartree
twoeener: 3696.90741930 hartree
cpcmener: -0.03415553 hartree
kineticenergy: 1921.60163268 hartree
xcener: -157.110581311813 hartree
chargesum: 0.0000000
charge: -0.072465 -0.173271 -0.170265 -0.174115 -0.282149 -0.443298 -0.327845 -0.088268 0.071583 0.032398 -0.071462 -0.267975 -0.252380 -0.156061 0.403147 -0.083511 0.428487 0.510197 -0.006821 -0.239994 -0.208190 -0.173921 0.197385 -0.142885 -0.151866 0.256797 -0.169196 -0.236520 -0.153236 -0.126944 -0.177465 0.094647 0.105475 0.103712 0.102759 0.097511 0.098333 0.090590 0.096984 0.145997 0.130397 0.137918 0.147225 0.160452 0.159557 0.157495 0.146319 0.159522 0.157246 0.157972
qa: -0.0725 -0.1733 -0.1703 -0.1741 -0.2821 -0.4433 -0.3278 -0.0883 0.0716 0.0324 -0.0715 -0.2680 -0.2524 -0.1561 0.4031 -0.0835 0.4285 0.5102 -0.0068 -0.2400 -0.2082 -0.1739 0.1974 -0.1429 -0.1519 0.2568 -0.1692 -0.2365 -0.1532 -0.1269 -0.1775 0.0946 0.1055 0.1037 0.1028 0.0975 0.0983 0.0906 0.0970 0.1460 0.1304 0.1379 0.1472 0.1605 0.1596 0.1575 0.1463 0.1595 0.1572 0.1580
va: 1.2630 1.1264 1.1338 1.1240 2.1689 2.0521 2.0695 3.1120 3.8076 3.7807 3.9007 3.9005 3.9070 3.8600 4.1012 4.0142 3.7320 4.4849 3.7472 4.0207 4.0699 3.9440 3.8366 3.9171 3.9073 3.7084 3.8923 3.9993 3.8959 3.8925 3.8975 1.0290 1.0246 0.9996 0.9994 1.0146 1.0015 1.0054 1.0023 1.0270 1.0194 1.0271 1.0024 0.9913 0.9936 0.9968 1.0075 0.9905 0.9893 0.9903
dispcorr: -0.023397566 hartree
energy: -1928.211613574329
dipole: 33.36394 -31.32417 2.03976 -19.85398 20.25926 0.40528 41.74793 -38.14160 3.60633
magnitude: 4.16299 au
magnitude: 10.58149 debye
