program: Orca
programVersion: 5.0.2
elementType: Cl F F F O O O N C C C C C C C C C C C C C C C C C C C C C C C H H H H H H H H H H H H H H H H H H H
charge: 0
multiplicity: 1
keywords: wb97x-d3
keywords: def2-TZVPP
keywords: def2/J RIJCOSX
keywords: DEFGRID2
keywords: scfconv7
keywords: smallprint printgap noloewdin
keywords: NOSOSCF
formula: C23H19ClF3NO3
InChI: InChI=1/C23H19ClF3NO3/c1-22(2)17(12-19(24)23(25,26)27)20(22)21(29)31-18(13-28)14-7-6-10-16(11-14)30-15-8-4-3-5-9-15/h3-12,17-18,20H,1-2H3
50 atoms
Cl -4.445869 2.824971 -2.077001
F  -3.417598 4.583486 -4.30774
F  -3.174874 2.499848 -4.759096
F  -1.446338 3.720691 -4.368749
O  0.946908 0.459748 0.311538
O  1.024733 2.104211 -1.187796
O  1.24755 -4.349358 1.877192
N  1.741424 -0.95554 -2.672912
C  -1.02367 3.484973 0.745208
C  -1.861302 2.785945 -0.287912
C  -0.748695 2.029473 0.438197
C  -0.051764 4.570706 0.35792
C  -1.692018 3.741468 2.074795
C  -1.779866 3.112856 -1.712044
C  0.473637 1.584697 -0.251124
C  -2.814786 3.158681 -2.544073
C  2.14028 -0.081068 -0.237601
C  -2.705486 3.493895 -3.997917
C  2.585119 -1.232595 0.628217
C  1.8986 -0.549467 -1.609662
C  1.70828 -2.273466 0.909461
C  3.879679 -1.248383 1.126141
C  2.139917 -3.339199 1.684866
C  4.299392 -2.324752 1.895273
C  3.441738 -3.374902 2.176085
C  1.305611 -5.12473 3.006208
C  1.386221 -4.564138 4.274857
C  1.215201 -6.498096 2.841249
C  1.389347 -5.397826 5.38354
C  1.206715 -7.319466 3.960409
C  1.300607 -6.77525 5.233217
H  -2.844519 2.486285 0.054318
H  -1.108856 1.325266 1.178524
H  0.414009 4.44185 -0.614833
H  -0.569018 5.53104 0.347503
H  0.747015 4.636955 1.098117
H  -2.242159 4.683729 2.048319
H  -2.395727 2.951655 2.339292
H  -0.950117 3.809493 2.872446
H  -0.810356 3.345671 -2.130249
H  2.92854 0.676434 -0.281066
H  0.695441 -2.273261 0.523273
H  4.558582 -0.433211 0.911452
H  5.310889 -2.350295 2.278292
H  3.792498 -4.211975 2.765691
H  1.441773 -3.490458 4.402726
H  1.146167 -6.918994 1.846107
H  1.455192 -4.96305 6.37238
H  1.133511 -8.391289 3.83167
H  1.301163 -7.419049 6.102889
elementType: Cl F O N C H
totalener: -1928.18831532 hartree
nucrepener: 3021.53256774 hartree
electener: -4949.72088306 hartree
oneelecener: -8650.45885336 hartree
twoeener: 3700.73797030 hartree
cpcmener: -0.03386607 hartree
kineticenergy: 1921.61309953 hartree
xcener: -157.113384854319 hartree
chargesum: -0.0000000
charge: -0.072591 -0.174231 -0.173070 -0.170170 -0.283736 -0.444964 -0.323208 -0.087915 0.075430 0.040494 -0.082060 -0.265829 -0.253077 -0.162997 0.408689 -0.087122 0.437364 0.510524 -0.005094 -0.241622 -0.229260 -0.180756 0.237484 -0.144091 -0.173362 0.266667 -0.189081 -0.233440 -0.143766 -0.126588 -0.177184 0.093867 0.103550 0.097607 0.101996 0.103251 0.098239 0.090859 0.096879 0.151731 0.127558 0.137708 0.146713 0.160167 0.157903 0.158286 0.146831 0.159299 0.157577 0.158542
qa: -0.0726 -0.1742 -0.1731 -0.1702 -0.2837 -0.4450 -0.3232 -0.0879 0.0754 0.0405 -0.0821 -0.2658 -0.2531 -0.1630 0.4087 -0.0871 0.4374 0.5105 -0.0051 -0.2416 -0.2293 -0.1808 0.2375 -0.1441 -0.1734 0.2667 -0.1891 -0.2334 -0.1438 -0.1266 -0.1772 0.0939 0.1036 0.0976 0.1020 0.1033 0.0982 0.0909 0.0969 0.1517 0.1276 0.1377 0.1467 0.1602 0.1579 0.1583 0.1468 0.1593 0.1576 0.1585
va: 1.2627 1.1243 1.1261 1.1339 2.1719 2.0495 2.0816 3.1118 3.7897 3.7795 3.9199 3.9014 3.9097 3.8550 4.0930 4.0176 3.7198 4.4836 3.7513 4.0222 4.0739 3.9463 3.8198 3.9253 3.9026 3.6981 3.9207 4.0076 3.8900 3.8865 3.9001 1.0284 1.0251 1.0131 1.0003 0.9990 1.0015 1.0053 1.0024 1.0276 1.0213 1.0272 1.0025 0.9917 0.9956 0.9956 1.0071 0.9902 0.9896 0.9903
dispcorr: -0.023338589 hartree
energy: -1928.211653913613
dipole: 26.85007 -25.63800 1.21207 -19.71328 19.77392 0.06064 48.98060 -44.54478 4.43582
magnitude: 4.59883 au
magnitude: 11.68930 debye
