program: Orca
programVersion: 5.0.2
elementType: Cl F F F O O O N C C C C C C C C C C C C C C C C C C C C C C C H H H H H H H H H H H H H H H H H H H
charge: 0
multiplicity: 1
keywords: wb97x-d3
keywords: def2-TZVPP
keywords: def2/J RIJCOSX
keywords: DEFGRID2
keywords: scfconv7
keywords: smallprint printgap noloewdin
keywords: NOSOSCF
formula: C23H19ClF3NO3
InChI: InChI=1/C23H19ClF3NO3/c1-22(2)17(12-19(24)23(25,26)27)20(22)21(29)31-18(13-28)14-7-6-10-16(11-14)30-15-8-4-3-5-9-15/h3-12,17-18,20H,1-2H3
50 atoms
Cl -2.736587 0.974145 -1.393284
F  -1.952429 2.039777 -4.132166
F  -2.470891 4.085742 -3.699137
F  -3.975654 2.548605 -3.620299
O  0.792703 0.442891 0.248289
O  0.654547 2.037946 -1.31371
O  2.651299 -4.084849 2.452426
N  0.04951 -1.826104 -2.10081
C  -0.398952 3.807654 1.033308
C  -1.588309 3.238635 0.346728
C  -0.470116 2.306036 0.78752
C  0.57993 4.67283 0.279795
C  -0.563091 4.215228 2.477888
C  -1.865649 3.487818 -1.081942
C  0.366077 1.63329 -0.217641
C  -2.389279 2.586212 -1.899114
C  1.608865 -0.345837 -0.610634
C  -2.69719 2.821966 -3.343384
C  2.547077 -1.16068 0.240109
C  0.732129 -1.177926 -1.442758
C  2.092907 -2.272321 0.94499
C  3.866935 -0.746336 0.339297
C  2.982041 -2.966722 1.754289
C  4.74338 -1.450907 1.153234
C  4.308234 -2.554604 1.862699
C  1.333434 -4.416937 2.653216
C  0.850946 -5.575303 2.065197
C  0.529713 -3.644176 3.480515
C  -0.455067 -5.972402 2.319746
C  -0.775915 -4.047246 3.719943
C  -1.271326 -5.210035 3.143115
H  -2.489074 3.129357 0.945941
H  -0.687402 1.701508 1.659655
H  1.578913 4.581827 0.709652
H  0.654211 4.444872 -0.780495
H  0.279459 5.718833 0.367804
H  0.387125 4.14972 3.010129
H  -0.91234 5.247236 2.544449
H  -1.284119 3.586537 3.001715
H  -1.657868 4.477539 -1.472031
H  2.192895 0.286299 -1.285493
H  1.062075 -2.593715 0.849878
H  4.210275 0.118273 -0.21456
H  5.775107 -1.135579 1.235995
H  4.990943 -3.107599 2.495797
H  1.493666 -6.165065 1.423626
H  0.920527 -2.744313 3.940164
H  -0.833393 -6.88047 1.868049
H  -1.4059 -3.451584 4.36805
H  -2.288883 -5.522165 3.338537
elementType: Cl F O N C H
totalener: -1928.18555133 hartree
nucrepener: 3186.13948294 hartree
electener: -5114.32503428 hartree
oneelecener: -8980.71925864 hartree
twoeener: 3866.39422436 hartree
cpcmener: -0.03406381 hartree
kineticenergy: 1921.61951600 hartree
xcener: -157.112210590633 hartree
chargesum: -0.0000000
charge: -0.068262 -0.170794 -0.170557 -0.172488 -0.274577 -0.434038 -0.322506 -0.083529 0.097835 -0.057959 -0.088355 -0.281781 -0.258051 -0.092719 0.357972 -0.049927 0.422002 0.504352 -0.010127 -0.245605 -0.195318 -0.195371 0.267613 -0.111573 -0.232599 0.235641 -0.200438 -0.176850 -0.140782 -0.146802 -0.159811 0.125603 0.098885 0.103062 0.097274 0.101861 0.098934 0.095844 0.089655 0.150653 0.122754 0.142206 0.145830 0.158708 0.146345 0.146886 0.155598 0.158229 0.158115 0.158961
qa: -0.0683 -0.1708 -0.1706 -0.1725 -0.2746 -0.4340 -0.3225 -0.0835 0.0978 -0.0580 -0.0884 -0.2818 -0.2581 -0.0927 0.3580 -0.0499 0.4220 0.5044 -0.0101 -0.2456 -0.1953 -0.1954 0.2676 -0.1116 -0.2326 0.2356 -0.2004 -0.1768 -0.1408 -0.1468 -0.1598 0.1256 0.0989 0.1031 0.0973 0.1019 0.0989 0.0958 0.0897 0.1507 0.1228 0.1422 0.1458 0.1587 0.1463 0.1469 0.1556 0.1582 0.1581 0.1590
va: 1.2734 1.1282 1.1343 1.1297 2.1493 2.0490 2.0846 3.1096 3.7619 3.8951 3.8572 3.8975 3.9058 3.7980 4.1124 3.9611 3.7055 4.4934 3.7773 4.0739 3.9607 3.9395 3.7745 3.9074 4.0024 3.7257 3.9971 3.9475 3.8909 3.8899 3.8883 1.0076 1.0306 1.0001 1.0128 0.9986 1.0016 1.0022 1.0044 1.0023 1.0302 1.0138 1.0004 0.9894 1.0074 1.0050 0.9975 0.9897 0.9904 0.9899
dispcorr: -0.025662376 hartree
energy: -1928.211213709285
dipole: 23.04478 -22.01692 1.02786 -3.91531 5.51583 1.60053 38.93788 -35.78675 3.15113
magnitude: 3.68073 au
magnitude: 9.35568 debye
