program: Orca
programVersion: 5.0.2
elementType: Cl F F F O O O N C C C C C C C C C C C C C C C C C C C C C C C H H H H H H H H H H H H H H H H H H H
charge: 0
multiplicity: 1
keywords: wb97x-d3
keywords: def2-TZVPP
keywords: def2/J RIJCOSX
keywords: DEFGRID2
keywords: scfconv7
keywords: smallprint printgap noloewdin
keywords: NOSOSCF
formula: C23H19ClF3NO3
InChI: InChI=1/C23H19ClF3NO3/c1-22(2)17(12-19(24)23(25,26)27)20(22)21(29)31-18(13-28)14-7-6-10-16(11-14)30-15-8-4-3-5-9-15/h3-12,17-18,20H,1-2H3
50 atoms
Cl -3.84873 3.788346 -0.595785
F  -4.971756 1.469276 0.868193
F  -3.877031 -0.068073 -0.167779
F  -5.277449 1.171234 -1.23408
O  2.151279 1.810714 0.796816
O  0.315641 0.553096 0.595625
O  2.495723 -3.944128 0.295787
N  4.80028 1.917086 2.748352
C  0.216551 2.403978 -2.031132
C  -0.92052 2.773891 -1.116045
C  0.490093 2.654321 -0.563186
C  0.324251 1.015256 -2.609823
C  0.693656 3.479526 -2.975446
C  -1.991232 1.829788 -0.78962
C  0.920012 1.556703 0.321695
C  -3.258674 2.162347 -0.56843
C  2.760668 0.784229 1.574898
C  -4.344066 1.175969 -0.274936
C  3.201308 -0.37783 0.716311
C  3.902755 1.43003 2.223524
C  2.658064 -1.630818 0.952799
C  4.09552 -0.176998 -0.329495
C  2.989374 -2.686384 0.112684
C  4.437119 -1.246196 -1.142027
C  3.878242 -2.499115 -0.935509
C  1.197925 -4.12825 0.692289
C  0.9478 -5.208835 1.526383
C  0.158393 -3.318205 0.249942
C  -0.35386 -5.476962 1.92441
C  -1.135846 -3.589378 0.669893
C  -1.399576 -4.664892 1.507236
H  -1.238911 3.806679 -1.192118
H  0.9686 3.601724 -0.342987
H  -0.283587 0.944488 -3.513401
H  1.358535 0.807851 -2.890802
H  0.005411 0.219057 -1.940824
H  0.113863 3.461655 -3.900058
H  0.598487 4.475321 -2.54153
H  1.742484 3.327056 -3.236295
H  -1.754195 0.776372 -0.74716
H  2.088138 0.438574 2.366405
H  1.970373 -1.77158 1.777531
H  4.52528 0.800352 -0.512703
H  5.135206 -1.103426 -1.956244
H  4.131353 -3.329626 -1.582532
H  1.766604 -5.835238 1.857935
H  0.344501 -2.483627 -0.414123
H  -0.545515 -6.32129 2.573932
H  -1.943321 -2.951965 0.332452
H  -2.41221 -4.86964 1.828597
elementType: Cl F O N C H
totalener: -1928.18686862 hartree
nucrepener: 3205.68005669 hartree
electener: -5133.86692531 hartree
oneelecener: -9018.03652515 hartree
twoeener: 3884.16959984 hartree
cpcmener: -0.03119697 hartree
kineticenergy: 1921.61337851 hartree
xcener: -157.113592126341 hartree
chargesum: 0.0000000
charge: -0.073684 -0.173375 -0.170040 -0.174047 -0.269516 -0.437951 -0.327039 -0.086361 0.075563 0.034616 -0.069221 -0.250218 -0.254182 -0.158352 0.377387 -0.087694 0.397725 0.509665 0.026016 -0.225393 -0.200979 -0.236082 0.285224 -0.118119 -0.225499 0.291236 -0.249797 -0.196719 -0.119492 -0.148455 -0.186836 0.094743 0.108735 0.109064 0.099989 0.078358 0.098378 0.090209 0.097383 0.147539 0.137901 0.145341 0.146986 0.159317 0.148827 0.145802 0.161110 0.157620 0.157463 0.156854
qa: -0.0737 -0.1734 -0.1700 -0.1740 -0.2695 -0.4380 -0.3270 -0.0864 0.0756 0.0346 -0.0692 -0.2502 -0.2542 -0.1584 0.3774 -0.0877 0.3977 0.5097 0.0260 -0.2254 -0.2010 -0.2361 0.2852 -0.1181 -0.2255 0.2912 -0.2498 -0.1967 -0.1195 -0.1485 -0.1868 0.0947 0.1087 0.1091 0.1000 0.0784 0.0984 0.0902 0.0974 0.1475 0.1379 0.1453 0.1470 0.1593 0.1488 0.1458 0.1611 0.1576 0.1575 0.1569
va: 1.2617 1.1262 1.1308 1.1235 2.1420 2.0598 2.0895 3.1125 3.8177 3.7842 3.8656 3.9046 3.9038 3.8666 4.1611 4.0068 3.7524 4.4789 3.5566 4.0677 3.9391 3.9744 3.7327 3.8985 4.0180 3.6980 4.0041 3.8996 3.8850 3.8973 3.9142 1.0285 1.0254 1.0014 1.0021 1.0127 1.0014 1.0054 1.0020 1.0160 1.0166 1.0081 1.0100 0.9892 1.0048 1.0084 0.9898 0.9888 0.9949 0.9911
dispcorr: -0.026582530 hartree
energy: -1928.213451151376
dipole: 34.13459 -33.73791 0.39667 -13.53537 13.59468 0.05931 -12.12944 10.36055 -1.76889
magnitude: 1.81379 au
magnitude: 4.61029 debye
