program: Orca
programVersion: 5.0.2
elementType: Cl F F F O O O N C C C C C C C C C C C C C C C C C C C C C C C H H H H H H H H H H H H H H H H H H H
charge: 0
multiplicity: 1
keywords: wb97x-d3
keywords: def2-TZVPP
keywords: def2/J RIJCOSX
keywords: DEFGRID2
keywords: scfconv7
keywords: smallprint printgap noloewdin
keywords: NOSOSCF
formula: C23H19ClF3NO3
InChI: InChI=1/C23H19ClF3NO3/c1-22(2)17(12-19(24)23(25,26)27)20(22)21(29)31-18(13-28)14-7-6-10-16(11-14)30-15-8-4-3-5-9-15/h3-12,17-18,20H,1-2H3
50 atoms
Cl -2.858812 2.361007 2.074624
F  -4.156454 0.292691 0.265751
F  -2.688434 -0.566431 1.574893
F  -2.30501 -0.449877 -0.541541
O  2.604045 2.395591 0.290215
O  1.480048 1.674542 -1.492554
O  1.810318 -3.411433 -0.292115
N  4.741918 0.81002 -1.842496
C  -0.303513 4.201611 -1.212005
C  -0.736473 3.409735 -0.006161
C  0.752679 3.642228 -0.304369
C  -0.54057 3.685285 -2.610333
C  -0.492099 5.697272 -1.106819
C  -1.323305 2.076575 -0.134779
C  1.60667 2.481744 -0.610534
C  -2.228984 1.55207 0.683535
C  3.327499 1.176307 0.32527
C  -2.840714 0.201073 0.49099
C  2.437851 0.005133 0.692035
C  4.087062 0.972328 -0.91343
C  2.474622 -1.193471 -0.001127
C  1.570766 0.160204 1.76976
C  1.657324 -2.2453 0.394659
C  0.746617 -0.889972 2.138981
C  0.784307 -2.101554 1.464044
C  0.750759 -4.252538 -0.501193
C  -0.50055 -3.785441 -0.88335
C  0.99551 -5.61317 -0.384546
C  -1.512229 -4.698808 -1.141913
C  -0.022597 -6.515059 -0.658865
C  -1.280475 -6.06359 -1.033044
H  -1.089941 3.992249 0.835779
H  1.215676 4.348036 0.375655
H  -1.546358 3.965067 -2.92836
H  0.16344 4.148438 -3.30352
H  -0.448192 2.60994 -2.724665
H  0.21187 6.218924 -1.757675
H  -1.501531 5.977925 -1.411886
H  -0.337794 6.059896 -0.089921
H  -1.014148 1.460377 -0.968912
H  4.068249 1.325776 1.115543
H  3.131734 -1.336128 -0.850544
H  1.531622 1.089175 2.323784
H  0.076391 -0.772235 2.980037
H  0.147308 -2.916969 1.781443
H  -0.69046 -2.724348 -0.983384
H  1.977601 -5.961283 -0.089511
H  -2.487652 -4.33564 -1.4389
H  0.171401 -7.57642 -0.572179
H  -2.073803 -6.76931 -1.240971
elementType: Cl F O N C H
totalener: -1928.18427043 hartree
nucrepener: 3314.57822283 hartree
electener: -5242.76249326 hartree
oneelecener: -9236.68960519 hartree
twoeener: 3993.92711192 hartree
cpcmener: -0.03213076 hartree
kineticenergy: 1921.62574256 hartree
xcener: -157.118820614049 hartree
chargesum: -0.0000000
charge: -0.070786 -0.173225 -0.176094 -0.175432 -0.289857 -0.424540 -0.324194 -0.077515 0.088921 0.041172 -0.058980 -0.267420 -0.254028 -0.176923 0.371812 -0.088261 0.520089 0.533803 -0.036410 -0.265361 -0.207186 -0.265987 0.277488 -0.146341 -0.185498 0.283120 -0.194088 -0.243624 -0.151529 -0.123608 -0.179355 0.094465 0.104604 0.099472 0.102715 0.096068 0.098238 0.098268 0.090577 0.149919 0.146178 0.121997 0.144169 0.158017 0.155718 0.162751 0.144698 0.156837 0.157475 0.157671
qa: -0.0708 -0.1732 -0.1761 -0.1754 -0.2899 -0.4245 -0.3242 -0.0775 0.0889 0.0412 -0.0590 -0.2674 -0.2540 -0.1769 0.3718 -0.0883 0.5201 0.5338 -0.0364 -0.2654 -0.2072 -0.2660 0.2775 -0.1463 -0.1855 0.2831 -0.1941 -0.2436 -0.1515 -0.1236 -0.1794 0.0945 0.1046 0.0995 0.1027 0.0961 0.0982 0.0983 0.0906 0.1499 0.1462 0.1220 0.1442 0.1580 0.1557 0.1628 0.1447 0.1568 0.1575 0.1577
va: 1.2639 1.1283 1.1195 1.1254 2.1257 2.0749 2.0858 3.1069 3.8135 3.7786 3.8870 3.8921 3.9036 3.8493 4.1141 4.0158 3.7911 4.4305 3.7423 4.1074 4.0265 3.9410 3.8102 3.8654 3.9024 3.6937 3.9073 4.0076 3.9048 3.8845 3.9059 1.0277 1.0283 1.0008 0.9992 1.0169 1.0022 1.0021 1.0049 1.0200 0.9889 1.0364 1.0113 0.9955 0.9971 0.9975 1.0086 0.9923 0.9892 0.9903
dispcorr: -0.028301485 hartree
energy: -1928.212571919384
dipole: 13.83786 -14.67076 -0.83290 5.66916 -3.97977 1.68939 -12.32183 13.95153 1.62970
magnitude: 2.49072 au
magnitude: 6.33091 debye
