program: Orca
programVersion: 5.0.2
elementType: Cl F F F O O O N C C C C C C C C C C C C C C C C C C C C C C C H H H H H H H H H H H H H H H H H H H
charge: 0
multiplicity: 1
keywords: wb97x-d3
keywords: def2-TZVPP
keywords: def2/J RIJCOSX
keywords: DEFGRID2
keywords: scfconv7
keywords: smallprint printgap noloewdin
keywords: NOSOSCF
formula: C23H19ClF3NO3
InChI: InChI=1/C23H19ClF3NO3/c1-22(2)17(12-19(24)23(25,26)27)20(22)21(29)31-18(13-28)14-7-6-10-16(11-14)30-15-8-4-3-5-9-15/h3-12,17-18,20H,1-2H3
50 atoms
Cl -3.449181 3.870137 -1.920209
F  -4.005568 3.882403 1.038662
F  -3.838313 1.751928 1.305068
F  -5.341793 2.564919 -0.001799
O  2.146247 1.275457 -0.466216
O  0.297826 0.399389 0.434474
O  2.638899 -3.874051 1.700161
N  4.815159 2.668764 0.889511
C  -0.70853 0.365789 -2.511144
C  -1.199606 1.679997 -1.971905
C  0.264523 1.28079 -1.801133
C  -1.149821 -0.942576 -1.901996
C  -0.536479 0.283607 -4.00857
C  -2.131466 1.764076 -0.846994
C  0.848513 0.930834 -0.495301
C  -3.119553 2.647105 -0.743055
C  2.898482 0.905748 0.689877
C  -4.075592 2.705646 0.406121
C  3.432198 -0.49785 0.544839
C  3.971348 1.897206 0.784834
C  2.804316 -1.524631 1.234147
C  4.487494 -0.77301 -0.319061
C  3.221543 -2.834398 1.034719
C  4.914537 -2.080616 -0.479614
C  4.277947 -3.119085 0.185191
C  1.275721 -3.989853 1.723936
C  0.46521 -3.557359 0.680461
C  0.725195 -4.618103 2.833083
C  -0.905812 -3.757456 0.76188
C  -0.645754 -4.81673 2.89532
C  -1.468939 -4.38456 1.864415
H  -1.319157 2.457252 -2.717081
H  0.941697 1.825515 -2.447785
H  -0.385397 -1.704869 -2.060981
H  -1.358941 -0.90252 -0.837315
H  -2.058883 -1.280951 -2.401506
H  -1.479736 0.010829 -4.485064
H  -0.207665 1.230486 -4.437623
H  0.201422 -0.476762 -4.270123
H  -2.029165 1.051318 -0.040136
H  2.29565 0.994545 1.598335
H  1.993655 -1.30588 1.917726
H  4.982003 0.023441 -0.861545
H  5.741858 -2.299312 -1.141065
H  4.600973 -4.143191 0.047374
H  0.885891 -3.078376 -0.194686
H  1.368208 -4.951685 3.638026
H  -1.535478 -3.423341 -0.05304
H  -1.070823 -5.307327 3.761466
H  -2.538591 -4.537143 1.918561
elementType: Cl F O N C H
totalener: -1928.18697732 hartree
nucrepener: 3186.75060624 hartree
electener: -5114.93758356 hartree
oneelecener: -8979.99724975 hartree
twoeener: 3865.05966619 hartree
cpcmener: -0.03077417 hartree
kineticenergy: 1921.62054995 hartree
xcener: -157.114957675447 hartree
chargesum: -0.0000000
charge: -0.072230 -0.173439 -0.170310 -0.173988 -0.275326 -0.451466 -0.329223 -0.087086 0.099518 0.030842 -0.089028 -0.298247 -0.252783 -0.154393 0.415715 -0.087684 0.408911 0.509872 -0.005988 -0.223447 -0.166568 -0.200205 0.250615 -0.131923 -0.211126 0.298504 -0.203564 -0.255108 -0.147796 -0.116249 -0.195843 0.093679 0.103626 0.107643 0.092381 0.108002 0.098611 0.090940 0.096976 0.148849 0.134530 0.145497 0.143034 0.159976 0.149191 0.157364 0.145707 0.169134 0.156850 0.157054
qa: -0.0722 -0.1734 -0.1703 -0.1740 -0.2753 -0.4515 -0.3292 -0.0871 0.0995 0.0308 -0.0890 -0.2982 -0.2528 -0.1544 0.4157 -0.0877 0.4089 0.5099 -0.0060 -0.2234 -0.1666 -0.2002 0.2506 -0.1319 -0.2111 0.2985 -0.2036 -0.2551 -0.1478 -0.1162 -0.1958 0.0937 0.1036 0.1076 0.0924 0.1080 0.0986 0.0909 0.0970 0.1488 0.1345 0.1455 0.1430 0.1600 0.1492 0.1574 0.1457 0.1691 0.1569 0.1571
va: 1.2634 1.1256 1.1336 1.1250 2.1402 2.0420 2.0833 3.1099 3.7766 3.7962 3.9016 3.9127 3.9061 3.8525 4.0984 4.0187 3.7330 4.4836 3.6428 4.0610 3.9304 3.9907 3.7540 3.9114 4.0268 3.7092 3.8953 4.0022 3.8816 3.8914 3.9373 1.0294 1.0279 0.9934 1.0034 1.0024 1.0018 1.0058 1.0019 1.0263 1.0198 1.0167 1.0082 0.9898 1.0037 0.9936 1.0085 0.9844 0.9886 0.9920
dispcorr: -0.026674561 hartree
energy: -1928.213651882779
dipole: 25.50861 -25.48627 0.02234 -37.02118 35.16157 -1.85960 -12.10055 10.27982 -1.82073
magnitude: 2.60263 au
magnitude: 6.61537 debye
