program: Orca
programVersion: 5.0.2
elementType: Cl F F F O O O N C C C C C C C C C C C C C C C C C C C C C C C H H H H H H H H H H H H H H H H H H H
charge: 0
multiplicity: 1
keywords: wb97x-d3
keywords: def2-TZVPP
keywords: def2/J RIJCOSX
keywords: DEFGRID2
keywords: scfconv7
keywords: smallprint printgap noloewdin
keywords: NOSOSCF
formula: C23H19ClF3NO3
InChI: InChI=1/C23H19ClF3NO3/c1-22(2)17(12-19(24)23(25,26)27)20(22)21(29)31-18(13-28)14-7-6-10-16(11-14)30-15-8-4-3-5-9-15/h3-12,17-18,20H,1-2H3
50 atoms
Cl -0.046509 1.195571 2.641427
F  -1.571071 -1.170662 1.829912
F  -3.281849 -0.162095 0.99255
F  -2.869908 -0.031233 3.105156
O  2.183532 2.046989 -0.494245
O  0.177817 1.321367 -1.1460
O  0.285921 -3.304744 0.341767
N  2.383829 0.280261 -3.420285
C  -0.828401 4.179893 -0.508987
C  -0.967684 3.39455 0.743659
C  0.373081 3.407289 0.014491
C  -1.54184 3.768194 -1.771746
C  -0.7101 5.67796 -0.360501
C  -1.771425 2.158365 0.839696
C  0.847447 2.165833 -0.605837
C  -1.469574 1.16852 1.668771
C  2.769673 0.810591 -0.888848
C  -2.303804 -0.053224 1.891284
C  2.406861 -0.322891 0.043829
C  2.505185 0.514732 -2.300663
C  1.498503 -1.312327 -0.313407
C  2.990978 -0.323592 1.303347
C  1.181425 -2.307636 0.600528
C  2.656034 -1.319215 2.209141
C  1.75674 -2.313399 1.865487
C  -0.180406 -3.48306 -0.943185
C  0.659516 -3.978991 -1.930403
C  -1.510359 -3.201787 -1.209195
C  0.152132 -4.193344 -3.203442
C  -2.009259 -3.432494 -2.484771
C  -1.181072 -3.922799 -3.484169
H  -0.938677 3.958069 1.672263
H  1.148355 4.001008 0.482204
H  -2.509895 4.270231 -1.81448
H  -0.971509 4.080578 -2.647689
H  -1.724571 2.700605 -1.856017
H  -0.200827 5.958721 0.561992
H  -0.1538 6.106778 -1.195175
H  -1.700329 6.136117 -0.348008
H  -2.670233 2.078088 0.239686
H  3.844196 0.994778 -0.819604
H  1.042231 -1.305722 -1.293975
H  3.703582 0.444155 1.576171
H  3.106752 -1.326736 3.192345
H  1.499054 -3.092675 2.571341
H  1.696878 -4.195171 -1.708288
H  -2.151041 -2.812169 -0.429173
H  0.802651 -4.5777 -3.97776
H  -3.048766 -3.220209 -2.695669
H  -1.572317 -4.096578 -4.47759
elementType: Cl F O N C H
totalener: -1928.16952647 hartree
nucrepener: 3455.25790536 hartree
electener: -5383.42743183 hartree
oneelecener: -9520.25569195 hartree
twoeener: 4136.82826011 hartree
cpcmener: -0.03998739 hartree
kineticenergy: 1921.62063992 hartree
xcener: -157.118409675808 hartree
chargesum: 0.0000000
charge: -0.069597 -0.168747 -0.175286 -0.173083 -0.283964 -0.459316 -0.332197 -0.096813 0.105403 -0.065820 -0.092923 -0.282300 -0.261206 -0.092046 0.400695 -0.049349 0.492947 0.515321 -0.035960 -0.247642 -0.125298 -0.281795 0.249594 -0.096416 -0.251666 0.246194 -0.177215 -0.196475 -0.155934 -0.152874 -0.160263 0.126681 0.098905 0.102150 0.104553 0.094233 0.091079 0.099737 0.096912 0.154121 0.148401 0.120784 0.143065 0.159825 0.147720 0.156145 0.143474 0.162732 0.160742 0.162772
qa: -0.0696 -0.1687 -0.1753 -0.1731 -0.2840 -0.4593 -0.3322 -0.0968 0.1054 -0.0658 -0.0929 -0.2823 -0.2612 -0.0920 0.4007 -0.0493 0.4929 0.5153 -0.0360 -0.2476 -0.1253 -0.2818 0.2496 -0.0964 -0.2517 0.2462 -0.1772 -0.1965 -0.1559 -0.1529 -0.1603 0.1267 0.0989 0.1021 0.1046 0.0942 0.0911 0.0997 0.0969 0.1541 0.1484 0.1208 0.1431 0.1598 0.1477 0.1561 0.1435 0.1627 0.1607 0.1628
va: 1.2720 1.1243 1.1308 1.1265 2.1381 2.0215 2.0530 3.1067 3.7736 3.8907 3.8877 3.8951 3.9024 3.8033 4.0478 3.9371 3.8223 4.4440 3.6450 4.0800 3.8393 3.9773 3.7209 3.8449 4.0142 3.7114 3.9328 3.9711 3.8844 3.9074 3.8829 1.0087 1.0317 0.9990 0.9998 1.0149 1.0044 1.0014 1.0020 1.0021 0.9915 1.0367 1.0061 0.9868 1.0063 0.9979 1.0185 0.9889 0.9900 0.9885
dispcorr: -0.031072485 hartree
energy: -1928.200598959295
dipole: 6.81125 -6.30583 0.50542 14.68906 -12.27090 2.41816 -21.80715 22.91147 1.10432
magnitude: 2.70601 au
magnitude: 6.87812 debye
