program: Orca
programVersion: 5.0.2
elementType: Cl F F F O O O N C C C C C C C C C C C C C C C C C C C C C C C H H H H H H H H H H H H H H H H H H H
charge: 0
multiplicity: 1
keywords: wb97x-d3
keywords: def2-TZVPP
keywords: def2/J RIJCOSX
keywords: DEFGRID2
keywords: scfconv7
keywords: smallprint printgap noloewdin
keywords: NOSOSCF
formula: C23H19ClF3NO3
InChI: InChI=1/C23H19ClF3NO3/c1-22(2)17(12-19(24)23(25,26)27)20(22)21(29)31-18(13-28)14-7-6-10-16(11-14)30-15-8-4-3-5-9-15/h3-12,17-18,20H,1-2H3
50 atoms
Cl -3.61743 3.820449 -1.901296
F  -4.591214 3.654982 0.977098
F  -3.122694 5.190211 0.67522
F  -2.62624 3.446174 1.830645
O  2.191628 0.948512 -1.606303
O  0.943065 1.663371 0.102432
O  1.791223 -3.694844 0.158705
N  5.4026 0.490493 -2.241422
C  -1.142739 0.039806 -1.725815
C  -1.514226 1.499208 -1.740797
C  -0.077732 1.084079 -2.000865
C  -1.142092 -0.751281 -0.440245
C  -1.574198 -0.778583 -2.917341
C  -1.939145 2.201848 -0.528477
C  1.017447 1.288653 -1.03942
C  -2.832992 3.184542 -0.496707
C  3.300494 0.833546 -0.728003
C  -3.28853 3.865812 0.753767
C  3.166523 -0.346199 0.210614
C  4.463887 0.646401 -1.595491
C  2.538703 -1.505824 -0.225023
C  3.669194 -0.257658 1.499578
C  2.402889 -2.572723 0.648014
C  3.549815 -1.34613 2.352477
C  2.91741 -2.507363 1.937789
C  0.928209 -4.402642 0.959558
C  0.960292 -5.785364 0.853329
C  0.01764 -3.773809 1.800059
C  0.072409 -6.546766 1.600368
C  -0.854763 -4.549212 2.550505
C  -0.832747 -5.93476 2.456622
H  -2.009035 1.824587 -2.647904
H  0.233035 1.1559 -3.03674
H  -0.777987 -0.208744 0.428655
H  -2.15597 -1.086379 -0.216754
H  -0.521671 -1.641121 -0.556042
H  -2.578973 -1.174737 -2.761267
H  -1.582772 -0.190833 -3.835268
H  -0.900764 -1.624581 -3.063748
H  -1.52677 1.889094 0.420348
H  3.459724 1.754538 -0.157617
H  2.142876 -1.591733 -1.229588
H  4.146445 0.653352 1.837262
H  3.947063 -1.288595 3.356822
H  2.828543 -3.346977 2.615019
H  1.671127 -6.260136 0.18889
H  -0.018382 -2.693846 1.873413
H  0.096872 -7.625256 1.515053
H  -1.560426 -4.061034 3.209863
H  -1.517393 -6.531603 3.044146
elementType: Cl F O N C H
totalener: -1928.17229921 hartree
nucrepener: 3176.80506641 hartree
electener: -5104.97736562 hartree
oneelecener: -8960.12157698 hartree
twoeener: 3855.14421136 hartree
cpcmener: -0.03775712 hartree
kineticenergy: 1921.59652690 hartree
xcener: -157.112612693123 hartree
chargesum: 0.0000000
charge: -0.075425 -0.175389 -0.175241 -0.171295 -0.283898 -0.446977 -0.342983 -0.100213 0.098071 0.034529 -0.054954 -0.288056 -0.257113 -0.157457 0.364450 -0.085307 0.426376 0.510742 0.021233 -0.226717 -0.258089 -0.204734 0.250299 -0.126859 -0.174685 0.308027 -0.253908 -0.192709 -0.127456 -0.168314 -0.181324 0.096410 0.110655 0.103803 0.118076 0.089437 0.099371 0.092889 0.098342 0.142379 0.148370 0.146582 0.150136 0.164145 0.160512 0.148617 0.161784 0.160840 0.161783 0.161246
qa: -0.0754 -0.1754 -0.1752 -0.1713 -0.2839 -0.4470 -0.3430 -0.1002 0.0981 0.0345 -0.0550 -0.2881 -0.2571 -0.1575 0.3644 -0.0853 0.4264 0.5107 0.0212 -0.2267 -0.2581 -0.2047 0.2503 -0.1269 -0.1747 0.3080 -0.2539 -0.1927 -0.1275 -0.1683 -0.1813 0.0964 0.1107 0.1038 0.1181 0.0894 0.0994 0.0929 0.0983 0.1424 0.1484 0.1466 0.1501 0.1641 0.1605 0.1486 0.1618 0.1608 0.1618 0.1612
va: 1.2597 1.1214 1.1238 1.1327 2.1177 2.0439 2.0443 3.1108 3.8011 3.8153 3.8630 3.8969 3.9009 3.8558 4.1605 4.0037 3.6947 4.4854 3.6078 4.0836 4.0065 3.9946 3.7669 3.8904 3.9136 3.6280 4.0184 3.8820 3.8838 3.9180 3.8963 1.0279 1.0258 1.0094 1.0011 1.0015 1.0008 1.0052 1.0027 1.0268 1.0145 1.0210 1.0006 0.9886 0.9935 1.0074 0.9922 0.9882 0.9903 0.9890
dispcorr: -0.027413924 hartree
energy: -1928.199713129728
dipole: 17.73536 -18.47577 -0.74040 -46.86942 45.09550 -1.77392 0.30501 0.24069 0.54570
magnitude: 1.99819 au
magnitude: 5.07900 debye
