program: Orca
programVersion: 5.0.2
elementType: Cl F F F O O O N C C C C C C C C C C C C C C C C C C C C C C C H H H H H H H H H H H H H H H H H H H
charge: 0
multiplicity: 1
keywords: wb97x-d3
keywords: def2-TZVPP
keywords: def2/J RIJCOSX
keywords: DEFGRID2
keywords: scfconv7
keywords: smallprint printgap noloewdin
keywords: NOSOSCF
formula: C23H19ClF3NO3
InChI: InChI=1/C23H19ClF3NO3/c1-22(2)17(12-19(24)23(25,26)27)20(22)21(29)31-18(13-28)14-7-6-10-16(11-14)30-15-8-4-3-5-9-15/h3-12,17-18,20H,1-2H3
50 atoms
Cl -1.491339 2.857908 2.716054
F  -0.867999 -0.066968 2.764184
F  -1.676513 -0.525675 0.82452
F  -2.96198 0.213447 2.386621
O  1.462797 2.003891 -0.132889
O  2.725282 3.838865 -0.092849
O  0.374017 -2.775468 -1.536636
N  4.329018 1.230353 -1.799969
C  -0.516425 3.855145 -1.632682
C  -1.004086 3.496669 -0.268775
C  0.394497 4.078616 -0.435103
C  -0.20624 2.791622 -2.656404
C  -1.076829 5.115171 -2.246644
C  -1.234574 2.102675 0.151482
C  1.638115 3.324897 -0.207858
C  -1.478459 1.737947 1.403394
C  2.587119 1.186168 0.152504
C  -1.746004 0.334756 1.839826
C  2.077428 -0.217297 0.363052
C  3.553729 1.233208 -0.950275
C  1.448237 -0.889309 -0.67668
C  2.213974 -0.809669 1.610591
C  0.957751 -2.170838 -0.463219
C  1.721966 -2.091351 1.807426
C  1.095217 -2.779717 0.780512
C  -0.331661 -3.946905 -1.354363
C  0.226551 -5.135693 -1.795464
C  -1.597532 -3.913557 -0.787249
C  -0.503094 -6.311523 -1.67437
C  -2.314193 -5.095558 -0.666932
C  -1.770872 -6.295488 -1.109081
H  -1.685028 4.208169 0.188643
H  0.503832 5.112955 -0.131225
H  0.182388 1.86247 -2.245871
H  -1.113329 2.547887 -3.212011
H  0.527139 3.16534 -3.372635
H  -0.367431 5.553238 -2.950461
H  -1.995646 4.893544 -2.792354
H  -1.309084 5.86691 -1.491722
H  -1.235722 1.330521 -0.608097
H  3.101104 1.534576 1.053585
H  1.338191 -0.430989 -1.65397
H  2.696958 -0.275585 2.418338
H  1.82524 -2.565649 2.774046
H  0.725544 -3.781012 0.95741
H  1.216409 -5.142068 -2.233907
H  -2.020757 -2.976944 -0.446796
H  -0.07433 -7.242705 -2.020732
H  -3.303529 -5.076073 -0.229015
H  -2.335476 -7.213734 -1.016251
elementType: Cl F O N C H
totalener: -1928.17103697 hartree
nucrepener: 3351.51523796 hartree
electener: -5279.68627493 hartree
oneelecener: -9309.97216814 hartree
twoeener: 4030.28589321 hartree
cpcmener: -0.04140387 hartree
kineticenergy: 1921.60413415 hartree
xcener: -157.112266458141 hartree
chargesum: 0.0000000
charge: -0.073278 -0.175519 -0.174298 -0.175836 -0.250755 -0.465235 -0.331157 -0.098238 0.098078 -0.072041 -0.123375 -0.259927 -0.260248 -0.042993 0.444667 -0.105735 0.379939 0.527734 0.023711 -0.213517 -0.271662 -0.195154 0.272901 -0.159474 -0.177830 0.209166 -0.182638 -0.156231 -0.155818 -0.167614 -0.149521 0.119072 0.104630 0.073987 0.107191 0.105268 0.100076 0.096757 0.091601 0.152387 0.134817 0.138889 0.147134 0.162117 0.152369 0.150719 0.159109 0.161365 0.161751 0.162665
qa: -0.0733 -0.1755 -0.1743 -0.1758 -0.2508 -0.4652 -0.3312 -0.0982 0.0981 -0.0720 -0.1234 -0.2599 -0.2602 -0.0430 0.4447 -0.1057 0.3799 0.5277 0.0237 -0.2135 -0.2717 -0.1952 0.2729 -0.1595 -0.1778 0.2092 -0.1826 -0.1562 -0.1558 -0.1676 -0.1495 0.1191 0.1046 0.0740 0.1072 0.1053 0.1001 0.0968 0.0916 0.1524 0.1348 0.1389 0.1471 0.1621 0.1524 0.1507 0.1591 0.1614 0.1618 0.1627
va: 1.2627 1.1183 1.1290 1.1266 2.1551 2.0362 2.0660 3.1073 3.8375 3.8347 3.9282 3.9115 3.9033 3.7520 4.0879 3.9856 3.7826 4.4426 3.6596 4.0229 4.0385 3.9150 3.7642 3.9138 3.8779 3.7358 3.9735 3.9217 3.8871 3.9048 3.8696 1.0134 1.0244 1.0069 1.0002 1.0014 1.0015 1.0017 1.0047 1.0012 1.0191 1.0199 1.0006 0.9900 1.0018 1.0021 1.0037 0.9888 0.9904 0.9884
dispcorr: -0.029826139 hartree
energy: -1928.200863109602
dipole: 3.39048 -5.75071 -2.36023 -3.27421 2.67201 -0.60220 -26.19900 26.52554 0.32654
magnitude: 2.45763 au
magnitude: 6.24680 debye
