program: Orca
programVersion: 5.0.2
elementType: Cl F F F O O O N C C C C C C C C C C C C C C C C C C C C C C C H H H H H H H H H H H H H H H H H H H
charge: 0
multiplicity: 1
keywords: wb97x-d3
keywords: def2-TZVPP
keywords: def2/J RIJCOSX
keywords: DEFGRID2
keywords: scfconv7
keywords: smallprint printgap noloewdin
keywords: NOSOSCF
formula: C23H19ClF3NO3
InChI: InChI=1/C23H19ClF3NO3/c1-22(2)17(12-19(24)23(25,26)27)20(22)21(29)31-18(13-28)14-7-6-10-16(11-14)30-15-8-4-3-5-9-15/h3-12,17-18,20H,1-2H3
50 atoms
Cl -1.713944 2.700903 2.716987
F  -1.075148 -0.245477 2.580326
F  -1.799728 -0.5324 0.572626
F  -3.14487 0.102482 2.130168
O  1.464604 1.984366 -0.162811
O  2.762618 3.791171 -0.278257
O  0.455084 -2.926759 -1.548353
N  4.035411 1.220357 -2.248491
C  -0.540726 3.946168 -1.553585
C  -0.986316 3.519866 -0.191775
C  0.415772 4.082428 -0.381709
C  -0.287216 2.928696 -2.638524
C  -1.105222 5.242059 -2.080851
C  -1.245107 2.109043 0.135119
C  1.659068 3.300947 -0.271324
C  -1.594384 1.67066 1.337062
C  2.608082 1.145503 -0.055075
C  -1.903872 0.243797 1.651307
C  2.111483 -0.248847 0.222269
C  3.397083 1.202854 -1.2915
C  1.489545 -0.980569 -0.780073
C  2.238761 -0.768796 1.503325
C  1.008824 -2.252816 -0.499937
C  1.748472 -2.038042 1.769755
C  1.136974 -2.788973 0.777354
C  -0.288835 -4.063559 -1.311407
C  0.197188 -5.276357 -1.771797
C  -1.519796 -3.978084 -0.67623
C  -0.569066 -6.422312 -1.599326
C  -2.271294 -5.130708 -0.502451
C  -1.800206 -6.35422 -0.962317
H  -1.632535 4.218215 0.330462
H  0.556525 5.095695 -0.024099
H  0.153683 1.995428 -2.294415
H  -1.225806 2.682973 -3.13789
H  0.384385 3.347682 -3.389036
H  -2.048298 5.059116 -2.598632
H  -1.295662 5.95844 -1.281444
H  -0.418086 5.703956 -2.791187
H  -1.187868 1.379591 -0.663351
H  3.255601 1.478799 0.761441
H  1.385486 -0.580278 -1.782569
H  2.717657 -0.190193 2.282443
H  1.847838 -2.455976 2.762444
H  0.77808 -3.783553 1.00631
H  1.159366 -5.324354 -2.265621
H  -1.889953 -3.024744 -0.322543
H  -0.196386 -7.371381 -1.961543
H  -3.23192 -5.068673 -0.008381
H  -2.392527 -7.249323 -0.826944
elementType: Cl F O N C H
totalener: -1928.17180018 hartree
nucrepener: 3339.24358175 hartree
electener: -5267.41538193 hartree
oneelecener: -9285.48230528 hartree
twoeener: 4018.06692336 hartree
cpcmener: -0.04076826 hartree
kineticenergy: 1921.61155084 hartree
xcener: -157.113321313013 hartree
chargesum: -0.0000000
charge: -0.073089 -0.177086 -0.177594 -0.175955 -0.246942 -0.461271 -0.330612 -0.097624 0.093433 -0.055671 -0.116680 -0.266101 -0.257852 -0.056867 0.435062 -0.106791 0.384361 0.531090 0.009852 -0.218559 -0.246347 -0.192506 0.261315 -0.166561 -0.170257 0.212273 -0.190258 -0.157661 -0.153281 -0.171238 -0.151056 0.113939 0.107856 0.077779 0.110361 0.105434 0.096804 0.092097 0.099392 0.151154 0.138026 0.132582 0.148110 0.162359 0.153902 0.149667 0.166918 0.160717 0.161117 0.162258
qa: -0.0731 -0.1771 -0.1776 -0.1760 -0.2469 -0.4613 -0.3306 -0.0976 0.0934 -0.0557 -0.1167 -0.2661 -0.2579 -0.0569 0.4351 -0.1068 0.3844 0.5311 0.0099 -0.2186 -0.2463 -0.1925 0.2613 -0.1666 -0.1703 0.2123 -0.1903 -0.1577 -0.1533 -0.1712 -0.1511 0.1139 0.1079 0.0778 0.1104 0.1054 0.0968 0.0921 0.0994 0.1512 0.1380 0.1326 0.1481 0.1624 0.1539 0.1497 0.1669 0.1607 0.1611 0.1623
va: 1.2630 1.1165 1.1287 1.1270 2.1560 2.0377 2.0686 3.1048 3.8516 3.8200 3.9201 3.9100 3.8991 3.7546 4.1061 3.9983 3.7616 4.4312 3.6848 4.0198 4.0282 3.9285 3.7797 3.9105 3.8805 3.7340 3.9800 3.9039 3.8859 3.9122 3.8698 1.0164 1.0232 1.0082 0.9996 1.0017 1.0014 1.0046 1.0018 1.0044 1.0154 1.0245 1.0001 0.9900 1.0001 1.0032 1.0005 0.9889 0.9911 0.9885
dispcorr: -0.029346720 hartree
energy: -1928.201146900570
dipole: 4.89686 -6.93040 -2.03355 -1.69702 1.26275 -0.43427 -23.99648 24.66375 0.66727
magnitude: 2.18384 au
magnitude: 5.55088 debye
