program: Orca
programVersion: 5.0.2
elementType: Cl F F F O O O N C C C C C C C C C C C C C C C C C C C C C C C H H H H H H H H H H H H H H H H H H H
charge: 0
multiplicity: 1
keywords: wb97x-d3
keywords: def2-TZVPP
keywords: def2/J RIJCOSX
keywords: DEFGRID2
keywords: scfconv7
keywords: smallprint printgap noloewdin
keywords: NOSOSCF
formula: C23H19ClF3NO3
InChI: InChI=1/C23H19ClF3NO3/c1-22(2)17(12-19(24)23(25,26)27)20(22)21(29)31-18(13-28)14-7-6-10-16(11-14)30-15-8-4-3-5-9-15/h3-12,17-18,20H,1-2H3
50 atoms
Cl -3.321291 4.169861 -2.684783
F  -2.205094 6.037885 -0.613422
F  -2.172637 4.606162 0.994678
F  -4.034396 5.143375 0.060262
O  1.742338 0.288433 -1.772619
O  0.829252 1.667501 -0.272295
O  0.787457 -3.656973 1.117428
N  4.748381 -0.951006 -2.389764
C  -1.716308 0.122969 -1.423845
C  -1.783019 1.556247 -1.878942
C  -0.500087 0.764288 -2.06271
C  -1.724872 -0.231579 0.042362
C  -2.450173 -0.883149 -2.274786
C  -1.918858 2.66169 -0.929507
C  0.713613 0.993984 -1.263842
C  -2.570269 3.793808 -1.172894
C  2.892738 0.185605 -0.944186
C  -2.741301 4.893424 -0.175111
C  2.623691 -0.655652 0.283175
C  3.918182 -0.44463 -1.77606
C  1.875169 -1.8192 0.16138
C  3.116604 -0.258794 1.516147
C  1.597926 -2.570347 1.292408
C  2.845108 -1.03189 2.636415
C  2.07934 -2.182768 2.538094
C  0.967425 -4.780342 1.888198
C  -0.167992 -5.387028 2.402865
C  2.226502 -5.328958 2.095421
C  -0.040214 -6.560936 3.132648
C  2.339867 -6.495701 2.837214
C  1.211711 -7.115842 3.358626
H  -2.301353 1.703039 -2.818847
H  -0.302587 0.45536 -3.082506
H  -1.262356 -1.20902 0.191187
H  -1.208019 0.475629 0.68585
H  -2.755543 -0.299752 0.39336
H  -2.428046 -0.617359 -3.331691
H  -2.009089 -1.875068 -2.165833
H  -3.494941 -0.946491 -1.96577
H  -1.49551 2.548538 0.058371
H  3.268974 1.17149 -0.652913
H  1.491237 -2.143025 -0.79869
H  3.696936 0.650468 1.604704
H  3.217708 -0.725208 3.60436
H  1.856409 -2.759965 3.425997
H  -1.142023 -4.947823 2.228211
H  3.110214 -4.858884 1.682567
H  -0.926391 -7.037154 3.530989
H  3.319751 -6.924329 3.001383
H  1.308296 -8.027277 3.933082
elementType: Cl F O N C H
totalener: -1928.17243616 hartree
nucrepener: 3121.79222842 hartree
electener: -5049.96466457 hartree
oneelecener: -8850.51281429 hartree
twoeener: 3800.54814971 hartree
cpcmener: -0.03686617 hartree
kineticenergy: 1921.60854401 hartree
xcener: -157.113970076058 hartree
chargesum: -0.0000000
charge: -0.075522 -0.175164 -0.171429 -0.175604 -0.284550 -0.448591 -0.341781 -0.100315 0.085552 0.035109 -0.050591 -0.281140 -0.254198 -0.154900 0.359683 -0.084789 0.433079 0.511029 0.038593 -0.226511 -0.285037 -0.207959 0.281195 -0.126841 -0.182821 0.261715 -0.240053 -0.179117 -0.132816 -0.156639 -0.176494 0.096314 0.109813 0.098533 0.099213 0.113335 0.092583 0.097348 0.098579 0.143615 0.146273 0.140137 0.150580 0.163700 0.161361 0.150239 0.159678 0.160925 0.162848 0.161831
qa: -0.0755 -0.1752 -0.1714 -0.1756 -0.2845 -0.4486 -0.3418 -0.1003 0.0856 0.0351 -0.0506 -0.2811 -0.2542 -0.1549 0.3597 -0.0848 0.4331 0.5110 0.0386 -0.2265 -0.2850 -0.2080 0.2812 -0.1268 -0.1828 0.2617 -0.2401 -0.1791 -0.1328 -0.1566 -0.1765 0.0963 0.1098 0.0985 0.0992 0.1133 0.0926 0.0973 0.0986 0.1436 0.1463 0.1401 0.1506 0.1637 0.1614 0.1502 0.1597 0.1609 0.1628 0.1618
va: 1.2597 1.1229 1.1325 1.1223 2.1208 2.0437 2.0332 3.1100 3.7968 3.8054 3.8556 3.9029 3.9014 3.8532 4.1671 4.0029 3.6927 4.4853 3.5757 4.0866 4.0347 3.9872 3.6934 3.8975 3.9261 3.7036 3.9987 3.9027 3.8868 3.8907 3.8892 1.0281 1.0258 1.0017 1.0119 1.0011 1.0050 1.0027 1.0013 1.0270 1.0147 1.0268 1.0009 0.9892 0.9938 1.0054 0.9962 0.9886 0.9892 0.9890
dispcorr: -0.026074324 hartree
energy: -1928.198510480802
dipole: 14.20249 -14.83080 -0.62831 -53.49449 51.64211 -1.85238 12.16368 -11.10400 1.05968
magnitude: 2.22464 au
magnitude: 5.65457 debye
