program: Orca
programVersion: 5.0.2
elementType: Cl F F F O O O N C C C C C C C C C C C C C C C C C C C C C C C H H H H H H H H H H H H H H H H H H H
charge: 0
multiplicity: 1
keywords: wb97x-d3
keywords: def2-TZVPP
keywords: def2/J RIJCOSX
keywords: DEFGRID2
keywords: scfconv7
keywords: smallprint printgap noloewdin
keywords: NOSOSCF
formula: C23H19ClF3NO3
InChI: InChI=1/C23H19ClF3NO3/c1-22(2)17(12-19(24)23(25,26)27)20(22)21(29)31-18(13-28)14-7-6-10-16(11-14)30-15-8-4-3-5-9-15/h3-12,17-18,20H,1-2H3
50 atoms
Cl -3.071632 1.534552 2.744581
F  -2.425428 -1.502991 2.133836
F  -1.544253 -0.645274 3.894038
F  -0.306869 -1.124114 2.202526
O  1.582762 1.635787 -0.217529
O  2.379998 3.71268 -0.169509
O  0.996128 -3.315427 -1.386127
N  4.123718 1.521013 -2.458336
C  -1.081926 2.908893 -0.972056
C  -1.135462 2.6184 0.503234
C  0.035448 3.410004 -0.082824
C  -0.87545 1.804938 -1.981223
C  -2.016166 3.985622 -1.471384
C  -0.979385 1.269708 1.05165
C  1.437071 2.959838 -0.158256
C  -1.726067 0.737345 2.012514
C  2.885092 1.073585 -0.197543
C  -1.497018 -0.636945 2.559705
C  2.716821 -0.406854 0.035375
C  3.567059 1.339269 -1.468236
C  1.923884 -1.156011 -0.8290
C  3.32421 -0.996789 1.133063
C  1.727323 -2.50305 -0.564668
C  3.134347 -2.351605 1.370526
C  2.329914 -3.105684 0.534125
C  -0.14688 -2.856108 -1.995065
C  -0.375963 -3.27437 -3.297712
C  -1.077139 -2.071074 -1.326309
C  -1.552633 -2.905125 -3.934224
C  -2.243663 -1.699234 -1.979505
C  -2.487834 -2.112372 -3.282641
H  -1.811749 3.255068 1.061681
H  -0.007199 4.469707 0.138032
H  -0.328086 0.942097 -1.612579
H  -1.849913 1.447756 -2.317259
H  -0.347321 2.187175 -2.855858
H  -1.618952 4.444974 -2.37801
H  -2.992344 3.561596 -1.710883
H  -2.163524 4.773844 -0.732939
H  -0.195889 0.639931 0.657767
H  3.49119 1.511464 0.600809
H  1.466666 -0.692957 -1.696203
H  3.936449 -0.404469 1.800544
H  3.604467 -2.820272 2.224325
H  2.169825 -4.159096 0.725322
H  0.355537 -3.890874 -3.80443
H  -0.906232 -1.758235 -0.305783
H  -1.732868 -3.236809 -4.948282
H  -2.967822 -1.087984 -1.456908
H  -3.401814 -1.823407 -3.783888
elementType: Cl F O N C H
totalener: -1928.17100556 hartree
nucrepener: 3401.96836425 hartree
electener: -5330.13936980 hartree
oneelecener: -9409.52333135 hartree
twoeener: 4079.38396155 hartree
cpcmener: -0.04179622 hartree
kineticenergy: 1921.60563287 hartree
xcener: -157.115138348251 hartree
chargesum: 0.0000000
charge: -0.071721 -0.178450 -0.173088 -0.173235 -0.263044 -0.462948 -0.337348 -0.096209 0.098252 0.028344 -0.115111 -0.228938 -0.261938 -0.103478 0.433979 -0.116581 0.385591 0.540489 0.012733 -0.216842 -0.204922 -0.191106 0.249981 -0.118472 -0.233426 0.269837 -0.230512 -0.164031 -0.142689 -0.214544 -0.144696 0.098227 0.106549 0.040887 0.101116 0.113855 0.098770 0.097873 0.092509 0.120557 0.134318 0.163208 0.149331 0.162113 0.149777 0.148835 0.162536 0.161351 0.160397 0.161913
qa: -0.0717 -0.1784 -0.1731 -0.1732 -0.2630 -0.4629 -0.3373 -0.0962 0.0983 0.0283 -0.1151 -0.2289 -0.2619 -0.1035 0.4340 -0.1166 0.3856 0.5405 0.0127 -0.2168 -0.2049 -0.1911 0.2500 -0.1185 -0.2334 0.2698 -0.2305 -0.1640 -0.1427 -0.2145 -0.1447 0.0982 0.1065 0.0409 0.1011 0.1139 0.0988 0.0979 0.0925 0.1206 0.1343 0.1632 0.1493 0.1621 0.1498 0.1488 0.1625 0.1614 0.1604 0.1619
va: 1.2651 1.1142 1.1322 1.1253 2.1588 2.0421 2.0800 3.1068 3.7614 3.7690 3.9369 3.9161 3.9163 3.8462 4.1195 3.9821 3.7846 4.4463 3.6640 4.0269 3.9309 3.9413 3.7451 3.8962 4.0050 3.7241 3.9780 3.8173 3.9000 3.8881 3.8705 1.0228 1.0235 1.0041 1.0009 1.0041 1.0009 1.0014 1.0053 0.9954 1.0211 0.9961 1.0001 0.9881 1.0046 1.0070 0.9797 0.9878 0.9915 0.9880
dispcorr: -0.031659600 hartree
energy: -1928.202665157821
dipole: 2.83309 -4.36441 -1.53132 7.73699 -7.69937 0.03761 -30.42370 30.90456 0.48085
magnitude: 1.60548 au
magnitude: 4.08082 debye
