program: Orca
programVersion: 5.0.2
elementType: Cl F F F O O O N C C C C C C C C C C C C C C C C C C C C C C C H H H H H H H H H H H H H H H H H H H
charge: 0
multiplicity: 1
keywords: wb97x-d3
keywords: def2-TZVPP
keywords: def2/J RIJCOSX
keywords: DEFGRID2
keywords: scfconv7
keywords: smallprint printgap noloewdin
keywords: NOSOSCF
formula: C23H19ClF3NO3
InChI: InChI=1/C23H19ClF3NO3/c1-22(2)17(12-19(24)23(25,26)27)20(22)21(29)31-18(13-28)14-7-6-10-16(11-14)30-15-8-4-3-5-9-15/h3-12,17-18,20H,1-2H3
50 atoms
Cl -1.975147 2.473225 2.489886
F  -1.422201 -0.44282 2.156669
F  -1.852048 -0.543222 0.049615
F  -3.39447 0.004751 1.445453
O  1.484948 2.025139 -0.017169
O  2.826567 3.80269 -0.124689
O  0.103692 -2.784755 -1.210523
N  3.911815 1.122852 -2.190577
C  -0.360459 4.164035 -1.46756
C  -0.929459 3.57911 -0.210952
C  0.481933 4.143452 -0.207547
C  0.006638 3.283199 -2.636032
C  -0.877773 5.518596 -1.884576
C  -1.232886 2.143968 -0.073453
C  1.713357 3.337831 -0.114406
C  -1.718374 1.587217 1.028782
C  2.602024 1.147709 0.074898
C  -2.094624 0.146881 1.163305
C  2.050391 -0.213119 0.408336
C  3.333627 1.142322 -1.196318
C  1.36818 -0.941096 -0.55538
C  2.169648 -0.694432 1.705093
C  0.794691 -2.158392 -0.216043
C  1.589507 -1.911006 2.029908
C  0.896662 -2.647426 1.081512
C  -0.213202 -4.119224 -1.106139
C  0.771078 -5.081117 -0.921128
C  -1.543671 -4.476637 -1.256723
C  0.406231 -6.418281 -0.874881
C  -1.892863 -5.820167 -1.223792
C  -0.92322 -6.792891 -1.025833
H  -1.619525 4.222689 0.325337
H  0.598918 5.102787 0.283726
H  0.751191 3.783628 -3.256757
H  0.414033 2.311278 -2.361477
H  -0.872921 3.10562 -3.256811
H  -1.76796 5.409445 -2.506385
H  -1.143078 6.134802 -1.025225
H  -0.128685 6.05776 -2.466403
H  -1.095135 1.504947 -0.936954
H  3.291156 1.47611 0.858157
H  1.266686 -0.56984 -1.569213
H  2.702194 -0.122154 2.453358
H  1.666179 -2.291195 3.039572
H  0.437925 -3.584921 1.365749
H  1.809359 -4.792995 -0.812713
H  -2.295965 -3.712331 -1.405537
H  1.169005 -7.17082 -0.724475
H  -2.929864 -6.103412 -1.347407
H  -1.199864 -7.83809 -0.992464
elementType: Cl F O N C H
totalener: -1928.17083993 hartree
nucrepener: 3347.63157836 hartree
electener: -5275.80241829 hartree
oneelecener: -9302.65226264 hartree
twoeener: 4026.84984436 hartree
cpcmener: -0.04091319 hartree
kineticenergy: 1921.61871842 hartree
xcener: -157.114502311275 hartree
chargesum: -0.0000000
charge: -0.075469 -0.175735 -0.175979 -0.175042 -0.243646 -0.458184 -0.330940 -0.094614 0.087621 -0.057789 -0.105203 -0.263814 -0.257322 -0.054217 0.422151 -0.109570 0.388079 0.526724 0.011273 -0.223590 -0.263336 -0.182355 0.272945 -0.157171 -0.179042 0.276946 -0.199877 -0.229399 -0.145254 -0.134480 -0.174766 0.112192 0.109753 0.106618 0.076909 0.109487 0.096448 0.091598 0.098632 0.151831 0.137370 0.131342 0.148830 0.161980 0.155965 0.159671 0.146072 0.162478 0.161732 0.162147
qa: -0.0755 -0.1757 -0.1760 -0.1750 -0.2436 -0.4582 -0.3309 -0.0946 0.0876 -0.0578 -0.1052 -0.2638 -0.2573 -0.0542 0.4222 -0.1096 0.3881 0.5267 0.0113 -0.2236 -0.2633 -0.1824 0.2729 -0.1572 -0.1790 0.2769 -0.1999 -0.2294 -0.1453 -0.1345 -0.1748 0.1122 0.1098 0.1066 0.0769 0.1095 0.0964 0.0916 0.0986 0.1518 0.1374 0.1313 0.1488 0.1620 0.1560 0.1597 0.1461 0.1625 0.1617 0.1621
va: 1.2611 1.1181 1.1242 1.1278 2.1582 2.0407 2.0536 3.1030 3.8711 3.8205 3.9013 3.9089 3.8966 3.7581 4.1261 3.9804 3.7550 4.4501 3.6884 4.0242 4.0319 3.9383 3.7150 3.9118 3.8864 3.6673 3.9294 4.0064 3.8767 3.8868 3.8898 1.0171 1.0220 1.0015 1.0090 1.0000 1.0015 1.0047 1.0020 1.0027 1.0152 1.0255 0.9997 0.9902 0.9977 0.9961 1.0089 0.9891 0.9885 0.9890
dispcorr: -0.029603778 hartree
energy: -1928.200443707924
dipole: 9.70292 -11.19808 -1.49516 0.28170 -0.54077 -0.25907 -20.23917 21.01552 0.77634
magnitude: 1.70450 au
magnitude: 4.33249 debye
