program: Orca
programVersion: 5.0.2
elementType: Cl F F F O O O N C C C C C C C C C C C C C C C C C C C C C C C H H H H H H H H H H H H H H H H H H H
charge: 0
multiplicity: 1
keywords: wb97x-d3
keywords: def2-TZVPP
keywords: def2/J RIJCOSX
keywords: DEFGRID2
keywords: scfconv7
keywords: smallprint printgap noloewdin
keywords: NOSOSCF
formula: C23H19ClF3NO3
InChI: InChI=1/C23H19ClF3NO3/c1-22(2)17(12-19(24)23(25,26)27)20(22)21(29)31-18(13-28)14-7-6-10-16(11-14)30-15-8-4-3-5-9-15/h3-12,17-18,20H,1-2H3
50 atoms
Cl -3.84846 0.481057 -0.003271
F  -1.010834 -0.823763 -2.269136
F  -2.663959 0.307456 -3.050966
F  -3.029586 -1.480211 -1.923443
O  1.700653 1.825206 -0.058807
O  2.285579 1.573181 2.074979
O  1.097227 -3.153702 0.310846
N  3.084934 1.803834 -3.040821
C  -0.749143 3.342014 0.893136
C  -1.208291 1.910243 0.920216
C  0.092493 2.315206 1.616848
C  -0.3194 3.989575 -0.400985
C  -1.491424 4.295773 1.798855
C  -1.233799 1.081019 -0.286162
C  1.452403 1.872686 1.255412
C  -2.289193 0.409079 -0.733908
C  2.960649 1.323618 -0.474764
C  -2.247588 -0.40324 -1.993661
C  3.126197 -0.163355 -0.234605
C  3.016719 1.603302 -1.910511
C  2.011051 -0.976718 -0.128865
C  4.402424 -0.701294 -0.133606
C  2.173399 -2.324869 0.152421
C  4.549502 -2.063309 0.084405
C  3.440323 -2.880873 0.246982
C  -0.039756 -2.681527 0.926649
C  0.006085 -1.820025 2.01682
C  -1.253113 -3.148001 0.442938
C  -1.182033 -1.421157 2.612865
C  -2.43145 -2.75463 1.062034
C  -2.402807 -1.886122 2.143487
H  -2.00072 1.696034 1.628232
H  -0.005652 2.338981 2.69548
H  -1.183824 4.480997 -0.849968
H  0.430697 4.758256 -0.210458
H  0.081412 3.306043 -1.143691
H  -1.796438 3.820856 2.731444
H  -0.864853 5.153862 2.047822
H  -2.38839 4.669067 1.302402
H  -0.33577 1.014895 -0.88453
H  3.78047 1.872034 0.001164
H  1.014932 -0.573642 -0.235024
H  5.273103 -0.063604 -0.218517
H  5.540126 -2.491152 0.158191
H  3.557625 -3.937157 0.45193
H  0.948715 -1.454889 2.404284
H  -1.273875 -3.821073 -0.404743
H  -1.145717 -0.744183 3.456454
H  -3.376458 -3.124798 0.687683
H  -3.32347 -1.57219 2.615688
elementType: Cl F O N C H
totalener: -1928.16798058 hartree
nucrepener: 3488.71117157 hartree
electener: -5416.87915216 hartree
oneelecener: -9584.05826039 hartree
twoeener: 4167.17910823 hartree
cpcmener: -0.03979579 hartree
kineticenergy: 1921.60608665 hartree
xcener: -157.120222067007 hartree
chargesum: -0.0000000
charge: -0.072416 -0.176541 -0.175526 -0.171489 -0.273410 -0.455437 -0.336131 -0.095564 0.111152 0.000518 -0.097273 -0.257662 -0.263512 -0.179250 0.413480 -0.077628 0.367494 0.535626 0.026119 -0.224274 -0.158346 -0.230887 0.267910 -0.105217 -0.242716 0.324986 -0.203367 -0.271074 -0.139868 -0.108894 -0.191751 0.104568 0.108316 0.099636 0.109061 0.089664 0.092918 0.098938 0.097675 0.155664 0.155225 0.119263 0.148970 0.162406 0.150033 0.152315 0.145970 0.159723 0.154078 0.156526
qa: -0.0724 -0.1765 -0.1755 -0.1715 -0.2734 -0.4554 -0.3361 -0.0956 0.1112 0.0005 -0.0973 -0.2577 -0.2635 -0.1793 0.4135 -0.0776 0.3675 0.5356 0.0261 -0.2243 -0.1583 -0.2309 0.2679 -0.1052 -0.2427 0.3250 -0.2034 -0.2711 -0.1399 -0.1089 -0.1918 0.1046 0.1083 0.0996 0.1091 0.0897 0.0929 0.0989 0.0977 0.1557 0.1552 0.1193 0.1490 0.1624 0.1500 0.1523 0.1460 0.1597 0.1541 0.1565
va: 1.2558 1.1174 1.1195 1.1302 2.1192 2.0381 2.0854 3.1073 3.8107 3.7672 3.9209 3.9049 3.9114 3.8213 4.1002 3.9653 3.7378 4.4521 3.5941 4.0710 3.9187 3.9918 3.7602 3.8758 4.0030 3.6131 3.8534 3.9548 3.8320 3.7950 3.8320 1.0173 1.0220 1.0017 1.0007 1.0062 1.0054 1.0014 1.0020 1.0056 1.0118 1.0054 1.0002 0.9871 1.0047 1.0037 1.0087 0.9909 0.9941 0.9955
dispcorr: -0.034756994 hartree
energy: -1928.202737578963
dipole: 14.57472 -14.67964 -0.10492 15.26962 -13.96900 1.30062 22.21152 -20.16492 2.04660
magnitude: 2.42718 au
magnitude: 6.16940 debye
