program: Orca
programVersion: 5.0.2
elementType: Cl F F F O O O N C C C C C C C C C C C C C C C C C C C C C C C H H H H H H H H H H H H H H H H H H H
charge: 0
multiplicity: 1
keywords: wb97x-d3
keywords: def2-TZVPP
keywords: def2/J RIJCOSX
keywords: DEFGRID2
keywords: scfconv7
keywords: smallprint printgap noloewdin
keywords: NOSOSCF
formula: C23H19ClF3NO3
InChI: InChI=1/C23H19ClF3NO3/c1-22(2)17(12-19(24)23(25,26)27)20(22)21(29)31-18(13-28)14-7-6-10-16(11-14)30-15-8-4-3-5-9-15/h3-12,17-18,20H,1-2H3
50 atoms
Cl -2.605084 1.951637 2.243227
F  -1.922481 -0.602975 -0.592111
F  -3.834601 0.043825 0.158664
F  -2.418033 -0.866217 1.486882
O  2.748833 2.410936 0.280659
O  1.614129 1.96855 -1.586869
O  0.876706 -2.788845 -1.107681
N  4.772984 0.891509 -2.027694
C  -0.284714 4.29267 -0.852061
C  -0.603281 3.318436 0.253274
C  0.851432 3.687396 -0.084259
C  -0.560878 3.96394 -2.299137
C  -0.559483 5.742764 -0.527184
C  -1.119245 1.975789 -0.013883
C  1.7379 2.624576 -0.585061
C  -1.968718 1.316804 0.767051
C  3.418539 1.158427 0.191775
C  -2.529231 -0.033039 0.448664
C  2.469557 0.022018 0.499523
C  4.136416 1.012362 -1.077713
C  2.118154 -0.933406 -0.438407
C  1.903643 -0.001933 1.771779
C  1.190209 -1.91566 -0.107153
C  0.97733 -0.9808 2.084197
C  0.610415 -1.943175 1.152867
C  0.16574 -3.93381 -0.823657
C  0.706204 -4.921669 -0.01191
C  -1.074403 -4.095577 -1.419707
C  -0.016281 -6.085384 0.206215
C  -1.780572 -5.272274 -1.205962
C  -1.258221 -6.265704 -0.390054
H  -0.939714 3.764804 1.180725
H  1.312598 4.318359 0.666572
H  0.157524 4.47308 -2.942746
H  -0.532144 2.906868 -2.543694
H  -1.553684 4.332002 -2.561224
H  -1.607645 5.981334 -0.712309
H  -0.340987 5.978324 0.514716
H  0.049094 6.396865 -1.153548
H  -0.802235 1.471886 -0.917921
H  4.186515 1.209159 0.967688
H  2.54397 -0.929424 -1.434445
H  2.180861 0.738624 2.510888
H  0.529119 -1.002492 3.068445
H  -0.121343 -2.693109 1.419817
H  1.678854 -4.785775 0.444342
H  -1.478075 -3.316292 -2.053417
H  0.398949 -6.857818 0.839995
H  -2.745719 -5.406679 -1.676345
H  -1.813773 -7.17863 -0.22207
elementType: Cl F O N C H
totalener: -1928.16959910 hartree
nucrepener: 3364.62000543 hartree
electener: -5292.78960453 hartree
oneelecener: -9337.35805747 hartree
twoeener: 4044.56845294 hartree
cpcmener: -0.03839570 hartree
kineticenergy: 1921.61058535 hartree
xcener: -157.116017007672 hartree
chargesum: 0.0000000
charge: -0.073897 -0.175780 -0.174833 -0.177164 -0.289025 -0.444827 -0.330666 -0.093677 0.097629 0.028760 -0.043231 -0.268214 -0.259530 -0.174904 0.371229 -0.085287 0.489934 0.544259 -0.012673 -0.251473 -0.208830 -0.254713 0.291790 -0.153324 -0.210414 0.265267 -0.185219 -0.224283 -0.148869 -0.139201 -0.168689 0.095613 0.108107 0.106385 0.092952 0.097766 0.099379 0.091674 0.097274 0.149873 0.148783 0.121602 0.145034 0.160999 0.149500 0.160402 0.147775 0.163107 0.161453 0.162175
qa: -0.0739 -0.1758 -0.1748 -0.1772 -0.2890 -0.4448 -0.3307 -0.0937 0.0976 0.0288 -0.0432 -0.2682 -0.2595 -0.1749 0.3712 -0.0853 0.4899 0.5443 -0.0127 -0.2515 -0.2088 -0.2547 0.2918 -0.1533 -0.2104 0.2653 -0.1852 -0.2243 -0.1489 -0.1392 -0.1687 0.0956 0.1081 0.1064 0.0930 0.0978 0.0994 0.0917 0.0973 0.1499 0.1488 0.1216 0.1450 0.1610 0.1495 0.1604 0.1478 0.1631 0.1615 0.1622
va: 1.2595 1.1259 1.1250 1.1194 2.1243 2.0541 2.0653 3.1078 3.8035 3.8033 3.8701 3.8893 3.9051 3.8514 4.1194 3.9874 3.8298 4.4356 3.6799 4.0868 3.9966 3.9530 3.7763 3.8795 3.8486 3.6697 3.9300 3.9930 3.8781 3.8850 3.8855 1.0269 1.0263 0.9990 1.0132 1.0016 1.0017 1.0047 1.0019 1.0182 0.9918 1.0385 1.0085 0.9915 1.0082 0.9952 1.0099 0.9886 0.9885 0.9887
dispcorr: -0.029752718 hartree
energy: -1928.199351816115
dipole: 12.00751 -12.76720 -0.75969 7.48105 -6.25330 1.22775 -8.30236 10.62894 2.32658
magnitude: 2.73815 au
magnitude: 6.95984 debye
