program: Orca
programVersion: 5.0.2
elementType: Cl F F F O O O N C C C C C C C C C C C C C C C C C C C C C C C H H H H H H H H H H H H H H H H H H H
charge: 0
multiplicity: 1
keywords: wb97x-d3
keywords: def2-TZVPP
keywords: def2/J RIJCOSX
keywords: DEFGRID2
keywords: scfconv7
keywords: smallprint printgap noloewdin
keywords: NOSOSCF
formula: C23H19ClF3NO3
InChI: InChI=1/C23H19ClF3NO3/c1-22(2)17(12-19(24)23(25,26)27)20(22)21(29)31-18(13-28)14-7-6-10-16(11-14)30-15-8-4-3-5-9-15/h3-12,17-18,20H,1-2H3
50 atoms
Cl -1.544986 2.267602 -2.983617
F  0.516472 4.388151 -2.200909
F  -0.775827 5.371157 -0.78809
F  -1.350391 5.224125 -2.857876
O  -0.073678 -0.809231 -1.358973
O  0.431472 1.066007 -0.256975
O  2.166666 -3.555094 2.354552
N  1.377094 -2.818027 -3.528291
C  -2.381702 0.755239 1.036349
C  -2.577157 1.580521 -0.183529
C  -1.829831 0.259392 -0.294437
C  -1.465935 1.213534 2.14341
C  -3.576268 -0.020095 1.539003
C  -1.889703 2.870535 -0.398123
C  -0.393236 0.255738 -0.598359
C  -1.440999 3.266581 -1.580325
C  1.296035 -0.939417 -1.713381
C  -0.762136 4.569936 -1.85081
C  2.173335 -1.318749 -0.542069
C  1.321892 -1.993654 -2.728277
C  1.734914 -2.281689 0.356457
C  3.406288 -0.70452 -0.378778
C  2.535213 -2.603175 1.442961
C  4.208496 -1.062477 0.694949
C  3.774143 -2.001851 1.616476
C  0.860006 -3.625294 2.775142
C  0.324722 -4.890703 2.964824
C  0.115618 -2.486959 3.05982
C  -0.96956 -5.016814 3.450572
C  -1.179724 -2.629185 3.53595
C  -1.728606 -3.889759 3.733124
H  -3.563307 1.542724 -0.639275
H  -2.384225 -0.54742 -0.757094
H  -2.053383 1.747904 2.891969
H  -1.006491 0.356021 2.63867
H  -0.669465 1.879013 1.821111
H  -4.165133 0.593573 2.222495
H  -4.230189 -0.336443 0.725923
H  -3.257962 -0.912382 2.080338
H  -1.779336 3.538245 0.448768
H  1.67222 -0.024272 -2.182926
H  0.779222 -2.77277 0.215831
H  3.73599 0.050158 -1.081069
H  5.171243 -0.588493 0.830384
H  4.389876 -2.267301 2.466144
H  0.917258 -5.768001 2.738718
H  0.533843 -1.497736 2.919868
H  -1.385744 -6.004336 3.6006
H  -1.759214 -1.742931 3.760071
H  -2.738596 -3.991809 4.106654
elementType: Cl F O N C H
totalener: -1928.17052545 hartree
nucrepener: 3290.85247364 hartree
electener: -5219.02299910 hartree
oneelecener: -9188.90571260 hartree
twoeener: 3969.88271350 hartree
cpcmener: -0.03997853 hartree
kineticenergy: 1921.61765103 hartree
xcener: -157.116083806578 hartree
chargesum: 0.0000000
charge: -0.070849 -0.173194 -0.169115 -0.173455 -0.284970 -0.452959 -0.341061 -0.100621 0.098775 -0.058140 -0.041455 -0.277782 -0.264959 -0.101621 0.328848 -0.049240 0.443206 0.504342 0.011380 -0.222196 -0.190467 -0.208256 0.236847 -0.119080 -0.228467 0.286611 -0.256282 -0.187896 -0.117170 -0.149884 -0.202261 0.127707 0.101682 0.107514 0.089206 0.098591 0.098831 0.093107 0.097060 0.155167 0.143295 0.149527 0.149178 0.162387 0.151647 0.148798 0.163172 0.161537 0.172335 0.160632
qa: -0.0708 -0.1732 -0.1691 -0.1735 -0.2850 -0.4530 -0.3411 -0.1006 0.0988 -0.0581 -0.0415 -0.2778 -0.2650 -0.1016 0.3288 -0.0492 0.4432 0.5043 0.0114 -0.2222 -0.1905 -0.2083 0.2368 -0.1191 -0.2285 0.2866 -0.2563 -0.1879 -0.1172 -0.1499 -0.2023 0.1277 0.1017 0.1075 0.0892 0.0986 0.0988 0.0931 0.0971 0.1552 0.1433 0.1495 0.1492 0.1624 0.1516 0.1488 0.1632 0.1615 0.1723 0.1606
va: 1.2700 1.1241 1.1367 1.1284 2.1174 2.0284 2.0672 3.1114 3.7577 3.9155 3.8174 3.8915 3.9067 3.8033 4.0952 3.9460 3.6937 4.4972 3.6037 4.0879 3.9286 3.9735 3.7559 3.8950 4.0065 3.7066 4.0102 3.8860 3.8781 3.8651 3.9336 1.0070 1.0308 0.9997 1.0081 1.0152 1.0013 1.0055 1.0056 1.0009 1.0179 1.0154 1.0014 0.9879 1.0032 1.0070 0.9928 0.9871 0.9800 0.9912
dispcorr: -0.029050342 hartree
energy: -1928.199575795387
dipole: -6.87699 5.13504 -1.74194 -32.92725 33.29379 0.36654 36.69199 -34.27950 2.41249
magnitude: 2.99814 au
magnitude: 7.62067 debye
