program: Orca
programVersion: 5.0.2
elementType: Cl F F F O O O N C C C C C C C C C C C C C C C C C C C C C C C H H H H H H H H H H H H H H H H H H H
charge: 0
multiplicity: 1
keywords: wb97x-d3
keywords: def2-TZVPP
keywords: def2/J RIJCOSX
keywords: DEFGRID2
keywords: scfconv7
keywords: smallprint printgap noloewdin
keywords: NOSOSCF
formula: C23H19ClF3NO3
InChI: InChI=1/C23H19ClF3NO3/c1-22(2)17(12-19(24)23(25,26)27)20(22)21(29)31-18(13-28)14-7-6-10-16(11-14)30-15-8-4-3-5-9-15/h3-12,17-18,20H,1-2H3
50 atoms
Cl -2.637328 0.349777 0.962095
F  -1.807715 -1.295229 -1.330486
F  -1.331717 0.306326 -2.689342
F  -3.359314 0.006367 -2.031999
O  1.640196 2.018621 -0.256448
O  2.443664 2.39162 1.790825
O  0.608942 -3.088665 -0.499629
N  2.908437 1.279101 -3.199528
C  -0.323252 4.29659 0.360357
C  -1.015579 2.983391 0.543622
C  0.311149 3.248821 1.254222
C  0.280278 4.68621 -0.966123
C  -0.91959 5.473609 1.095095
C  -1.152453 2.014991 -0.551473
C  1.563695 2.52797 0.975527
C  -1.849805 0.888042 -0.476971
C  2.800352 1.260548 -0.588397
C  -2.081369 -0.023872 -1.637769
C  2.708363 -0.150912 -0.064708
C  2.84995 1.276712 -2.051081
C  1.679985 -0.97912 -0.503654
C  3.620713 -0.603152 0.875454
C  1.586659 -2.26407 -0.00225
C  3.510171 -1.895641 1.372806
C  2.495017 -2.731672 0.940381
C  -0.350306 -3.571011 0.35294
C  -0.975453 -4.753465 -0.023059
C  -0.723855 -2.910366 1.516479
C  -1.984344 -5.274696 0.772466
C  -1.731102 -3.45002 2.305724
C  -2.363815 -4.630663 1.943449
H  -1.848547 2.985549 1.238528
H  0.210808 3.441205 2.315611
H  1.072119 5.420611 -0.813852
H  0.704038 3.865441 -1.538173
H  -0.486494 5.153496 -1.585935
H  -1.705254 5.934598 0.494436
H  -1.356596 5.179528 2.049625
H  -0.159972 6.231554 1.291756
H  -0.703427 2.251418 -1.507323
H  3.710356 1.746445 -0.223416
H  0.964675 -0.635231 -1.241179
H  4.417817 0.044908 1.215631
H  4.223781 -2.254344 2.101989
H  2.414212 -3.741198 1.323676
H  -0.675567 -5.256728 -0.933575
H  -0.252561 -1.981273 1.809519
H  -2.469372 -6.195683 0.476308
H  -2.022675 -2.934168 3.211285
H  -3.146912 -5.043817 2.564832
elementType: Cl F O N C H
totalener: -1928.17027539 hartree
nucrepener: 3409.98777789 hartree
electener: -5338.15805329 hartree
oneelecener: -9427.50686952 hartree
twoeener: 4089.34881624 hartree
cpcmener: -0.04036988 hartree
kineticenergy: 1921.61890306 hartree
xcener: -157.115515697291 hartree
chargesum: -0.0000000
charge: -0.075348 -0.166744 -0.176092 -0.173973 -0.264737 -0.466386 -0.338660 -0.096884 0.093738 -0.029255 -0.106191 -0.269997 -0.257958 -0.103589 0.443070 -0.081996 0.372206 0.522302 0.015201 -0.221865 -0.222559 -0.159864 0.192070 -0.137606 -0.148366 0.281899 -0.244500 -0.182063 -0.132311 -0.169309 -0.183047 0.107052 0.104809 0.104510 0.089685 0.105884 0.097325 0.092521 0.098755 0.142729 0.146923 0.143639 0.149943 0.163545 0.162235 0.148059 0.146936 0.160943 0.161502 0.161823
qa: -0.0753 -0.1667 -0.1761 -0.1740 -0.2647 -0.4664 -0.3387 -0.0969 0.0937 -0.0293 -0.1062 -0.2700 -0.2580 -0.1036 0.4431 -0.0820 0.3722 0.5223 0.0152 -0.2219 -0.2226 -0.1599 0.1921 -0.1376 -0.1484 0.2819 -0.2445 -0.1821 -0.1323 -0.1693 -0.1830 0.1071 0.1048 0.1045 0.0897 0.1059 0.0973 0.0925 0.0988 0.1427 0.1469 0.1436 0.1499 0.1635 0.1622 0.1481 0.1469 0.1609 0.1615 0.1618
va: 1.2578 1.1219 1.1244 1.1262 2.1382 2.0421 2.0307 3.1038 3.8347 3.8013 3.9072 3.9085 3.9003 3.8121 4.1059 3.9483 3.7810 4.4539 3.5838 4.0663 4.0359 3.9340 3.8517 3.8932 3.9431 3.5880 4.0030 3.8360 3.8986 3.9088 3.8871 1.0216 1.0243 1.0005 1.0089 0.9989 1.0018 1.0047 1.0018 1.0184 1.0135 1.0256 1.0052 0.9888 0.9931 1.0082 1.0099 0.9879 0.9903 0.9886
dispcorr: -0.030660088 hartree
energy: -1928.200935482693
dipole: 12.44757 -12.50769 -0.06011 14.04299 -12.52368 1.51930 16.03157 -14.09329 1.93828
magnitude: 2.46350 au
magnitude: 6.26173 debye
