program: Orca
programVersion: 5.0.2
elementType: Cl F F F O O O N C C C C C C C C C C C C C C C C C C C C C C C H H H H H H H H H H H H H H H H H H H
charge: 0
multiplicity: 1
keywords: wb97x-d3
keywords: def2-TZVPP
keywords: def2/J RIJCOSX
keywords: DEFGRID2
keywords: scfconv7
keywords: smallprint printgap noloewdin
keywords: NOSOSCF
formula: C23H19ClF3NO3
InChI: InChI=1/C23H19ClF3NO3/c1-22(2)17(12-19(24)23(25,26)27)20(22)21(29)31-18(13-28)14-7-6-10-16(11-14)30-15-8-4-3-5-9-15/h3-12,17-18,20H,1-2H3
50 atoms
Cl -3.827882 1.571753 -0.58432
F  -2.801006 -0.205604 -2.911257
F  -2.88052 -1.161204 -0.991726
F  -0.974684 -0.70907 -1.886748
O  1.365307 1.696349 0.543446
O  1.742352 3.057498 2.263578
O  1.38329 -3.906271 0.214574
N  4.741028 2.014456 0.714044
C  -0.120103 4.187458 -0.586366
C  -1.116315 3.132552 -0.188863
C  -0.038575 3.578908 0.796958
C  0.932679 3.91723 -1.632872
C  -0.638155 5.604398 -0.635244
C  -1.141684 1.813259 -0.821958
C  1.098605 2.774226 1.282152
C  -2.231858 1.0842 -1.033954
C  2.419182 0.830233 0.945221
C  -2.214757 -0.249874 -1.709029
C  2.342015 -0.375143 0.044251
C  3.711133 1.513846 0.823502
C  1.914051 -1.580303 0.579326
C  2.627801 -0.261345 -1.31244
C  1.760948 -2.679664 -0.257614
C  2.482775 -1.369938 -2.130013
C  2.043239 -2.579576 -1.611211
C  0.41666 -4.003425 1.186892
C  -0.714459 -3.197021 1.187019
C  0.585773 -4.991812 2.145797
C  -1.675155 -3.381228 2.170954
C  -0.39016 -5.172826 3.115802
C  -1.51953 -4.365914 3.138024
H  -2.090854 3.516221 0.089056
H  -0.411955 4.218091 1.58833
H  1.779054 4.58975 -1.487122
H  1.321544 2.902401 -1.645308
H  0.518779 4.119321 -2.621833
H  -1.084324 5.810269 -1.609559
H  -1.395869 5.788985 0.126233
H  0.174224 6.316315 -0.481943
H  -0.212804 1.395327 -1.181126
H  2.301342 0.533433 1.991426
H  1.702074 -1.654975 1.63895
H  2.960566 0.680205 -1.732267
H  2.703162 -1.293516 -3.18609
H  1.923357 -3.442583 -2.253362
H  -0.854056 -2.436655 0.430364
H  1.470202 -5.615871 2.129555
H  -2.555192 -2.751565 2.172641
H  -0.259076 -5.946098 3.861231
H  -2.27419 -4.505423 3.900243
elementType: Cl F O N C H
totalener: -1928.17172244 hartree
nucrepener: 3325.31290354 hartree
electener: -5253.48462598 hartree
oneelecener: -9256.61882151 hartree
twoeener: 4003.13419552 hartree
cpcmener: -0.04089668 hartree
kineticenergy: 1921.59811369 hartree
xcener: -157.111739828435 hartree
chargesum: -0.0000000
charge: -0.072975 -0.174164 -0.178986 -0.173427 -0.253965 -0.461775 -0.337824 -0.097737 0.080990 0.046152 -0.121196 -0.251128 -0.258740 -0.133146 0.436873 -0.104600 0.374187 0.541680 0.018324 -0.215037 -0.167535 -0.238988 0.264202 -0.131277 -0.221372 0.260589 -0.163555 -0.232046 -0.175699 -0.134905 -0.172440 0.095756 0.107842 0.105117 0.082913 0.104419 0.097845 0.092172 0.097791 0.131464 0.137894 0.148689 0.149820 0.161261 0.150158 0.159085 0.148711 0.157017 0.161018 0.160546
qa: -0.0730 -0.1742 -0.1790 -0.1734 -0.2540 -0.4618 -0.3378 -0.0977 0.0810 0.0462 -0.1212 -0.2511 -0.2587 -0.1331 0.4369 -0.1046 0.3742 0.5417 0.0183 -0.2150 -0.1675 -0.2390 0.2642 -0.1313 -0.2214 0.2606 -0.1636 -0.2320 -0.1757 -0.1349 -0.1724 0.0958 0.1078 0.1051 0.0829 0.1044 0.0978 0.0922 0.0978 0.1315 0.1379 0.1487 0.1498 0.1613 0.1502 0.1591 0.1487 0.1570 0.1610 0.1605
va: 1.2638 1.1249 1.1199 1.1268 2.1624 2.0392 2.0691 3.1045 3.7988 3.7425 3.9187 3.9076 3.9110 3.8889 4.1151 4.0178 3.7786 4.4249 3.6340 4.0161 3.9367 3.9483 3.7269 3.9188 4.0053 3.7127 3.8743 3.9837 3.9237 3.8870 3.8913 1.0261 1.0231 1.0006 1.0068 1.0014 1.0011 1.0053 1.0016 1.0110 1.0173 1.0027 1.0042 0.9885 1.0040 0.9948 1.0070 0.9936 0.9881 0.9892
dispcorr: -0.028629423 hartree
energy: -1928.200351861268
dipole: 16.50392 -17.95698 -1.45306 11.27291 -10.93071 0.34220 7.96058 -8.47440 -0.51383
magnitude: 1.57877 au
magnitude: 4.01291 debye
