program: Orca
programVersion: 5.0.2
elementType: Cl F F F O O O N C C C C C C C C C C C C C C C C C C C C C C C H H H H H H H H H H H H H H H H H H H
charge: 0
multiplicity: 1
keywords: wb97x-d3
keywords: def2-TZVPP
keywords: def2/J RIJCOSX
keywords: DEFGRID2
keywords: scfconv7
keywords: smallprint printgap noloewdin
keywords: NOSOSCF
formula: C23H19ClF3NO3
InChI: InChI=1/C23H19ClF3NO3/c1-22(2)17(12-19(24)23(25,26)27)20(22)21(29)31-18(13-28)14-7-6-10-16(11-14)30-15-8-4-3-5-9-15/h3-12,17-18,20H,1-2H3
50 atoms
Cl -1.933885 1.933755 3.158443
F  -3.855699 -0.086812 1.714069
F  -2.148684 -0.920461 2.704766
F  -2.243502 -0.915433 0.554525
O  2.534941 2.061036 -0.124861
O  0.983879 1.3016 -1.536966
O  0.674698 -3.452328 -0.057488
N  4.018381 0.191284 -2.568511
C  -0.694359 3.822245 -0.81524
C  -0.762078 3.040438 0.469334
C  0.58273 3.291048 -0.236494
C  -1.301538 3.292403 -2.090356
C  -0.862805 5.317224 -0.670619
C  -1.339199 1.696312 0.534815
C  1.335281 2.130427 -0.737561
C  -1.865567 1.144228 1.623487
C  3.20655 0.807921 -0.161249
C  -2.523502 -0.200705 1.644273
C  2.384589 -0.263511 0.522313
C  3.621535 0.462204 -1.523514
C  1.941052 -1.396227 -0.141708
C  2.040608 -0.046581 1.853412
C  1.1253 -2.301085 0.526928
C  1.237193 -0.964351 2.509285
C  0.768067 -2.090432 1.849583
C  0.342186 -3.486588 -1.389275
C  0.599076 -4.673792 -2.060696
C  -0.276735 -2.424336 -2.037289
C  0.23587 -4.797207 -3.393883
C  -0.621694 -2.558782 -3.374758
C  -0.369527 -3.73988 -4.059255
H  -0.869062 3.631403 1.370324
H  1.203067 4.01222 0.282324
H  -2.358694 3.560785 -2.119675
H  -0.821445 3.758722 -2.951692
H  -1.231652 2.216985 -2.2202
H  -0.354386 5.838727 -1.483072
H  -1.918781 5.58847 -0.706541
H  -0.454062 5.685159 0.270811
H  -1.365317 1.103054 -0.370173
H  4.125756 0.97925 0.403677
H  2.217429 -1.573798 -1.173481
H  2.393965 0.833667 2.374897
H  0.96711 -0.801023 3.543842
H  0.136763 -2.806958 2.358681
H  1.073992 -5.495882 -1.540293
H  -0.48666 -1.497046 -1.52039
H  0.434788 -5.72534 -3.913456
H  -1.097247 -1.728863 -3.880699
H  -0.64423 -3.83584 -5.10106
elementType: Cl F O N C H
totalener: -1928.16935354 hartree
nucrepener: 3409.14672751 hartree
electener: -5337.31608105 hartree
oneelecener: -9426.19678043 hartree
twoeener: 4088.88069938 hartree
cpcmener: -0.03823502 hartree
kineticenergy: 1921.60498995 hartree
xcener: -157.116085672058 hartree
chargesum: -0.0000000
charge: -0.072875 -0.174663 -0.174688 -0.171362 -0.288612 -0.450867 -0.334279 -0.091634 0.098140 0.018803 -0.045040 -0.272797 -0.256063 -0.156696 0.383549 -0.091371 0.494498 0.536683 -0.004589 -0.255512 -0.198106 -0.271529 0.307630 -0.105155 -0.264354 0.310516 -0.251607 -0.186453 -0.126542 -0.167738 -0.183393 0.096851 0.106073 0.100723 0.103013 0.094961 0.098654 0.098429 0.091351 0.145421 0.147702 0.139668 0.144714 0.158474 0.147498 0.146694 0.143483 0.161041 0.160120 0.161239
qa: -0.0729 -0.1747 -0.1747 -0.1714 -0.2886 -0.4509 -0.3343 -0.0916 0.0981 0.0188 -0.0450 -0.2728 -0.2561 -0.1567 0.3835 -0.0914 0.4945 0.5367 -0.0046 -0.2555 -0.1981 -0.2715 0.3076 -0.1052 -0.2644 0.3105 -0.2516 -0.1865 -0.1265 -0.1677 -0.1834 0.0969 0.1061 0.1007 0.1030 0.0950 0.0987 0.0984 0.0914 0.1454 0.1477 0.1397 0.1447 0.1585 0.1475 0.1467 0.1435 0.1610 0.1601 0.1612
va: 1.2598 1.1235 1.1231 1.1243 2.1223 2.0412 2.0811 3.1049 3.8197 3.7911 3.8755 3.8896 3.8984 3.8730 4.0952 3.9930 3.8350 4.4506 3.6537 4.0916 3.8866 3.9488 3.7307 3.8158 3.9567 3.6516 3.9999 3.8776 3.8803 3.9224 3.8979 1.0271 1.0281 1.0005 0.9988 1.0160 1.0021 1.0022 1.0048 1.0120 0.9927 1.0128 1.0098 0.9922 1.0093 1.0082 0.9983 0.9880 0.9904 0.9891
dispcorr: -0.030931668 hartree
energy: -1928.200285206635
dipole: 11.06710 -11.13928 -0.07218 12.08531 -9.70635 2.37896 -24.01958 25.24562 1.22604
magnitude: 2.67728 au
magnitude: 6.80511 debye
