program: Orca
programVersion: 5.0.2
elementType: Cl F F F O O O N C C C C C C C C C C C C C C C C C C C C C C C H H H H H H H H H H H H H H H H H H H
charge: 0
multiplicity: 1
keywords: wb97x-d3
keywords: def2-TZVPP
keywords: def2/J RIJCOSX
keywords: DEFGRID2
keywords: scfconv7
keywords: smallprint printgap noloewdin
keywords: NOSOSCF
formula: C23H19ClF3NO3
InChI: InChI=1/C23H19ClF3NO3/c1-22(2)17(12-19(24)23(25,26)27)20(22)21(29)31-18(13-28)14-7-6-10-16(11-14)30-15-8-4-3-5-9-15/h3-12,17-18,20H,1-2H3
50 atoms
Cl -3.807572 3.356702 -0.150916
F  -5.317094 0.787783 -0.619439
F  -4.522118 0.872873 1.374609
F  -3.7084 -0.52361 -0.049778
O  2.15456 1.934441 0.638948
O  0.328275 0.648106 0.73574
O  2.460696 -3.760263 0.389241
N  4.912877 2.288048 2.424455
C  0.147708 2.092439 -2.149657
C  -1.01685 2.470581 -1.276504
C  0.397171 2.551091 -0.728195
C  0.388043 0.656977 -2.545876
C  0.526688 3.076657 -3.228641
C  -1.986028 1.473551 -0.811877
C  0.902147 1.60375 0.280127
C  -3.197799 1.750321 -0.3446
C  2.84838 1.002858 1.469494
C  -4.184283 0.714509 0.088889
C  3.278966 -0.205792 0.674783
C  3.999646 1.73847 1.991757
C  2.699217 -1.433192 0.952896
C  4.184924 -0.07165 -0.372684
C  3.007864 -2.526918 0.154698
C  4.505216 -1.179676 -1.139972
C  3.909658 -2.408541 -0.890561
C  1.120802 -3.848439 0.685831
C  0.170573 -3.057638 0.050144
C  0.742435 -4.801169 1.620135
C  -1.16906 -3.224866 0.36943
C  -0.602927 -4.964677 1.919647
C  -1.563146 -4.174405 1.303056
H  -1.434335 3.45155 -1.471614
H  0.799247 3.553164 -0.631306
H  1.433655 0.521528 -2.827107
H  0.166463 -0.07317 -1.769873
H  -0.222568 0.407001 -3.414805
H  -0.050145 2.886373 -4.135514
H  0.341436 4.106848 -2.922445
H  1.584657 2.984853 -3.479545
H  -1.721042 0.427748 -0.888024
H  2.238166 0.70271 2.327013
H  2.002077 -1.528299 1.77614
H  4.639284 0.886723 -0.592274
H  5.211845 -1.085903 -1.953371
H  4.1437 -3.268881 -1.504303
H  0.460214 -2.32049 -0.688718
H  1.494035 -5.411152 2.105027
H  -1.908344 -2.606248 -0.121498
H  -0.896869 -5.709454 2.647469
H  -2.609887 -4.298321 1.545959
elementType: Cl F O N C H
totalener: -1928.17260452 hartree
nucrepener: 3263.96259141 hartree
electener: -5192.13519593 hartree
oneelecener: -9134.69392385 hartree
twoeener: 3942.55872792 hartree
cpcmener: -0.03802104 hartree
kineticenergy: 1921.59195945 hartree
xcener: -157.110079585867 hartree
chargesum: 0.0000000
charge: -0.074550 -0.175245 -0.175314 -0.167427 -0.271672 -0.454135 -0.342868 -0.101486 0.088646 0.009488 -0.064671 -0.240832 -0.253523 -0.141638 0.386117 -0.087569 0.420434 0.507196 0.015381 -0.222345 -0.184644 -0.228598 0.264864 -0.128053 -0.216543 0.283915 -0.202333 -0.237758 -0.169712 -0.127010 -0.189973 0.099821 0.112286 0.101078 0.049701 0.112789 0.098021 0.092169 0.097844 0.147176 0.140297 0.148772 0.148419 0.163026 0.151572 0.181551 0.148180 0.169230 0.160331 0.159594
qa: -0.0746 -0.1752 -0.1753 -0.1674 -0.2717 -0.4541 -0.3429 -0.1015 0.0886 0.0095 -0.0647 -0.2408 -0.2535 -0.1416 0.3861 -0.0876 0.4204 0.5072 0.0154 -0.2223 -0.1846 -0.2286 0.2649 -0.1281 -0.2165 0.2839 -0.2023 -0.2378 -0.1697 -0.1270 -0.1900 0.0998 0.1123 0.1011 0.0497 0.1128 0.0980 0.0922 0.0978 0.1472 0.1403 0.1488 0.1484 0.1630 0.1516 0.1816 0.1482 0.1692 0.1603 0.1596
va: 1.2619 1.1237 1.1221 1.1321 2.1407 2.0390 2.0677 3.1103 3.8464 3.8028 3.8538 3.8980 3.8937 3.8525 4.1473 4.0040 3.7256 4.4804 3.5618 4.0706 3.9260 3.9664 3.7300 3.8993 4.0170 3.6917 3.8789 3.9955 3.8984 3.8873 3.9143 1.0248 1.0238 1.0031 1.0174 1.0018 1.0013 1.0047 1.0023 0.9952 1.0157 1.0111 1.0087 0.9882 1.0031 0.9739 1.0071 0.9925 0.9878 0.9907
dispcorr: -0.028348338 hartree
energy: -1928.200952855301
dipole: 32.43952 -32.13035 0.30917 -11.36149 11.37442 0.01293 -16.36752 14.21558 -2.15194
magnitude: 2.17407 au
magnitude: 5.52606 debye
