program: Orca
programVersion: 5.0.2
elementType: Cl F F F O O O N C C C C C C C C C C C C C C C C C C C C C C C H H H H H H H H H H H H H H H H H H H
charge: 0
multiplicity: 1
keywords: wb97x-d3
keywords: def2-TZVPP
keywords: def2/J RIJCOSX
keywords: DEFGRID2
keywords: scfconv7
keywords: smallprint printgap noloewdin
keywords: NOSOSCF
formula: C23H19ClF3NO3
InChI: InChI=1/C23H19ClF3NO3/c1-22(2)17(12-19(24)23(25,26)27)20(22)21(29)31-18(13-28)14-7-6-10-16(11-14)30-15-8-4-3-5-9-15/h3-12,17-18,20H,1-2H3
50 atoms
Cl -1.816851 -0.163133 -0.293703
F  -3.829981 0.328389 -2.478943
F  -1.838442 0.42074 -3.271703
F  -3.018655 2.215541 -3.119189
O  1.671876 1.127251 0.426925
O  0.984456 2.635225 -1.063329
O  1.732543 -3.832991 1.484404
N  1.455911 -0.109375 -2.783471
C  -0.718015 3.878112 1.211172
C  -1.50083 2.684467 0.794157
C  -0.014602 2.538326 1.124917
C  -0.4289 4.99505 0.239277
C  -0.944671 4.371513 2.620716
C  -1.986109 2.494267 -0.587086
C  0.905767 2.160404 0.042246
C  -2.18248 1.301123 -1.130484
C  2.574377 0.554502 -0.510246
C  -2.719573 1.07217 -2.506617
C  3.089646 -0.710376 0.127784
C  1.908587 0.219752 -1.777851
C  2.16191 -1.688843 0.467052
C  4.43535 -0.877642 0.405468
C  2.587185 -2.834011 1.117592
C  4.851094 -2.046293 1.035569
C  3.937416 -3.019374 1.401774
C  0.386682 -3.551072 1.594398
C  -0.497901 -4.278002 0.81466
C  -0.067119 -2.591709 2.490659
C  -1.86184 -4.04254 0.938165
C  -1.429903 -2.355115 2.592647
C  -2.330846 -3.078241 1.819284
H  -2.139743 2.232092 1.547184
H  0.190357 2.04775 2.068896
H  -1.222747 5.740645 0.308619
H  0.508585 5.489553 0.497539
H  -0.363666 4.68616 -0.800094
H  -1.796046 5.053215 2.649883
H  -1.148539 3.554126 3.31259
H  -0.07075 4.91232 2.987219
H  -2.222497 3.372628 -1.175091
H  3.39305 1.244631 -0.734325
H  1.115273 -1.547052 0.226223
H  5.151008 -0.109583 0.142506
H  5.899342 -2.192426 1.259435
H  4.264714 -3.919945 1.90621
H  -0.12611 -5.021922 0.121044
H  0.63253 -2.030092 3.097914
H  -2.55626 -4.61226 0.334144
H  -1.787918 -1.604267 3.284848
H  -3.393032 -2.892452 1.907569
elementType: Cl F O N C H
totalener: -1928.17020127 hartree
nucrepener: 3374.63566459 hartree
electener: -5302.80586586 hartree
oneelecener: -9358.18244753 hartree
twoeener: 4055.37658167 hartree
cpcmener: -0.04376564 hartree
kineticenergy: 1921.61102829 hartree
xcener: -157.114541099878 hartree
chargesum: 0.0000000
charge: -0.078776 -0.173773 -0.169678 -0.169722 -0.268066 -0.452058 -0.336408 -0.098043 0.118285 -0.068379 -0.105145 -0.286714 -0.260997 -0.111869 0.392583 -0.024783 0.454023 0.502369 0.011809 -0.258012 -0.210204 -0.215106 0.274707 -0.096915 -0.250775 0.270054 -0.224647 -0.179244 -0.116861 -0.156233 -0.192698 0.125481 0.101691 0.101551 0.105231 0.093880 0.097600 0.090986 0.098886 0.153309 0.136433 0.121090 0.150598 0.161822 0.149853 0.149282 0.159799 0.161234 0.161919 0.160631
qa: -0.0788 -0.1738 -0.1697 -0.1697 -0.2681 -0.4521 -0.3364 -0.0980 0.1183 -0.0684 -0.1051 -0.2867 -0.2610 -0.1119 0.3926 -0.0248 0.4540 0.5024 0.0118 -0.2580 -0.2102 -0.2151 0.2747 -0.0969 -0.2508 0.2701 -0.2246 -0.1792 -0.1169 -0.1562 -0.1927 0.1255 0.1017 0.1016 0.1052 0.0939 0.0976 0.0910 0.0989 0.1533 0.1364 0.1211 0.1506 0.1618 0.1499 0.1493 0.1598 0.1612 0.1619 0.1606
va: 1.2817 1.1278 1.1267 1.1354 2.1668 2.0277 2.0745 3.1075 3.7770 3.8705 3.8956 3.8921 3.9044 3.7987 4.0826 3.9299 3.7474 4.4902 3.6846 4.0383 3.9474 3.9424 3.7655 3.8839 4.0090 3.6757 4.0069 3.9127 3.8536 3.8295 3.8503 1.0100 1.0298 0.9993 0.9997 1.0140 1.0018 1.0039 1.0020 1.0046 1.0091 1.0274 1.0015 0.9876 1.0057 1.0050 0.9947 0.9873 0.9902 0.9905
dispcorr: -0.029485557 hartree
energy: -1928.199686826458
dipole: 15.00264 -14.46000 0.54265 10.83936 -9.27109 1.56827 30.41350 -26.83769 3.57581
magnitude: 3.94212 au
magnitude: 10.02008 debye
