program: Orca
programVersion: 5.0.2
elementType: Cl F F F O O O N C C C C C C C C C C C C C C C C C C C C C C C H H H H H H H H H H H H H H H H H H H
charge: 0
multiplicity: 1
keywords: wb97x-d3
keywords: def2-TZVPP
keywords: def2/J RIJCOSX
keywords: DEFGRID2
keywords: scfconv7
keywords: smallprint printgap noloewdin
keywords: NOSOSCF
formula: C23H19ClF3NO3
InChI: InChI=1/C23H19ClF3NO3/c1-22(2)17(12-19(24)23(25,26)27)20(22)21(29)31-18(13-28)14-7-6-10-16(11-14)30-15-8-4-3-5-9-15/h3-12,17-18,20H,1-2H3
50 atoms
Cl -3.764373 3.490534 -0.395077
F  -5.307372 0.859614 -0.664019
F  -4.692288 1.290409 1.344212
F  -3.775783 -0.331742 0.267691
O  2.188779 1.863467 0.500011
O  0.364683 0.57946 0.642627
O  2.469801 -3.82485 0.47438
N  4.912132 2.306582 2.320418
C  0.084251 1.86062 -2.284479
C  -1.005155 2.373232 -1.383832
C  0.441136 2.404895 -0.915522
C  0.210999 0.389429 -2.592877
C  0.456085 2.741709 -3.451498
C  -2.00709 1.476009 -0.802192
C  0.940061 1.513064 0.144371
C  -3.207567 1.852882 -0.377899
C  2.870597 0.972891 1.384606
C  -4.242798 0.909951 0.144625
C  3.314657 -0.269412 0.651647
C  4.010342 1.734516 1.893949
C  2.719128 -1.481579 0.961804
C  4.24651 -0.180652 -0.377344
C  3.035248 -2.605704 0.21056
C  4.575151 -1.318606 -1.095829
C  3.962684 -2.532499 -0.81656
C  1.125119 -3.888181 0.756714
C  0.191313 -3.113766 0.078008
C  0.724969 -4.799848 1.722283
C  -1.154251 -3.253336 0.386813
C  -0.625816 -4.938083 2.00991
C  -1.569638 -4.162732 1.350724
H  -1.374245 3.361516 -1.631249
H  0.90058 3.386377 -0.917618
H  1.222336 0.17097 -2.938978
H  0.006582 -0.271653 -1.75348
H  -0.477315 0.122213 -3.396002
H  -0.185185 2.526758 -4.307574
H  0.352591 3.799895 -3.212375
H  1.488648 2.564381 -3.755336
H  -1.782839 0.420042 -0.748218
H  2.245867 0.711483 2.244173
H  2.002531 -1.541156 1.771425
H  4.71272 0.766027 -0.621333
H  5.300945 -1.260269 -1.895518
H  4.202605 -3.416474 -1.39325
H  0.499092 -2.411228 -0.686517
H  1.463694 -5.396894 2.241651
H  -1.881615 -2.64525 -0.135495
H  -0.936557 -5.650564 2.76253
H  -2.620537 -4.266997 1.584741
elementType: Cl F O N C H
totalener: -1928.17266448 hartree
nucrepener: 3253.57686536 hartree
electener: -5181.74952984 hartree
oneelecener: -9113.87993638 hartree
twoeener: 3932.13040653 hartree
cpcmener: -0.03754276 hartree
kineticenergy: 1921.60445515 hartree
xcener: -157.112690807270 hartree
chargesum: 0.0000000
charge: -0.074686 -0.175324 -0.174957 -0.168995 -0.274622 -0.458141 -0.342868 -0.100801 0.079631 0.026242 -0.069579 -0.235415 -0.254729 -0.147021 0.396275 -0.088247 0.420282 0.508428 0.010905 -0.222635 -0.183332 -0.221261 0.266069 -0.130561 -0.218013 0.283936 -0.200454 -0.237040 -0.167287 -0.129963 -0.181082 0.098170 0.110223 0.100861 0.050190 0.111921 0.098585 0.092517 0.097522 0.146063 0.139478 0.147904 0.148054 0.163048 0.151408 0.178674 0.148269 0.161914 0.160295 0.160151
qa: -0.0747 -0.1753 -0.1750 -0.1690 -0.2746 -0.4581 -0.3429 -0.1008 0.0796 0.0262 -0.0696 -0.2354 -0.2547 -0.1470 0.3963 -0.0882 0.4203 0.5084 0.0109 -0.2226 -0.1833 -0.2213 0.2661 -0.1306 -0.2180 0.2839 -0.2005 -0.2370 -0.1673 -0.1300 -0.1811 0.0982 0.1102 0.1009 0.0502 0.1119 0.0986 0.0925 0.0975 0.1461 0.1395 0.1479 0.1481 0.1630 0.1514 0.1787 0.1483 0.1619 0.1603 0.1602
va: 1.2617 1.1215 1.1241 1.1321 2.1410 2.0341 2.0683 3.1109 3.8405 3.7863 3.8641 3.8978 3.8980 3.8640 4.1300 4.0070 3.7289 4.4839 3.5708 4.0695 3.9219 3.9734 3.7289 3.9041 4.0177 3.6914 3.8708 3.9960 3.9023 3.8874 3.9013 1.0260 1.0251 1.0028 1.0188 1.0017 1.0011 1.0048 1.0026 0.9987 1.0161 1.0119 1.0083 0.9883 1.0034 0.9779 1.0070 0.9936 0.9880 0.9897
dispcorr: -0.028029015 hartree
energy: -1928.200693493990
dipole: 32.16312 -31.87601 0.28711 -14.46626 14.26602 -0.20023 -16.56931 14.40369 -2.16563
magnitude: 2.19373 au
magnitude: 5.57603 debye
