program: Orca
programVersion: 5.0.2
elementType: Cl F F F O O O N C C C C C C C C C C C C C C C C C C C C C C C H H H H H H H H H H H H H H H H H H H
charge: 0
multiplicity: 1
keywords: wb97x-d3
keywords: def2-TZVPP
keywords: def2/J RIJCOSX
keywords: DEFGRID2
keywords: scfconv7
keywords: smallprint printgap noloewdin
keywords: NOSOSCF
formula: C23H19ClF3NO3
InChI: InChI=1/C23H19ClF3NO3/c1-22(2)17(12-19(24)23(25,26)27)20(22)21(29)31-18(13-28)14-7-6-10-16(11-14)30-15-8-4-3-5-9-15/h3-12,17-18,20H,1-2H3
50 atoms
Cl -3.834582 3.583452 -1.335717
F  -4.81553 2.180968 1.137222
F  -3.955303 0.263088 0.668228
F  -5.430129 1.136712 -0.632914
O  2.233878 1.726873 0.254524
O  0.407447 0.473227 0.556296
O  2.562596 -3.907652 0.875005
N  4.914906 2.45967 2.026847
C  -0.07756 1.444627 -2.41995
C  -0.992401 2.255574 -1.542663
C  0.481776 2.127216 -1.189192
C  -0.209364 -0.056223 -2.492387
C  0.313071 2.067652 -3.737218
C  -2.058839 1.621695 -0.768327
C  0.979078 1.347955 -0.044578
C  -3.291925 2.097925 -0.63728
C  2.923696 0.961585 1.24333
C  -4.370875 1.412211 0.136809
C  3.397745 -0.351167 0.669842
C  4.041921 1.80552 1.664421
C  2.797115 -1.524798 1.098559
C  4.364253 -0.377089 -0.331126
C  3.140552 -2.72592 0.492905
C  4.723693 -1.588856 -0.897897
C  4.105259 -2.766882 -0.500809
C  1.201614 -3.951569 1.066596
C  0.316092 -3.23129 0.272287
C  0.735392 -4.793512 2.066276
C  -1.047509 -3.35337 0.500181
C  -0.631676 -4.915045 2.272726
C  -1.528214 -4.191411 1.498104
H  -1.23171 3.239694 -1.927278
H  1.062141 3.019652 -1.389688
H  0.739219 -0.499366 -2.799408
H  -0.509181 -0.532946 -1.563034
H  -0.953535 -0.316365 -3.246572
H  -0.438725 1.849793 -4.497141
H  0.410933 3.15071 -3.662371
H  1.266258 1.665889 -4.08385
H  -1.849405 0.681658 -0.278324
H  2.296964 0.795186 2.125177
H  2.054882 -1.497829 1.886531
H  4.837266 0.537087 -0.668864
H  5.478302 -1.618886 -1.672235
H  4.367386 -3.70995 -0.962249
H  0.673132 -2.584758 -0.519946
H  1.437065 -5.348692 2.676086
H  -1.736683 -2.789128 -0.115141
H  -0.993327 -5.571978 3.053125
H  -2.592767 -4.282613 1.667853
elementType: Cl F O N C H
totalener: -1928.17284645 hartree
nucrepener: 3221.39686448 hartree
electener: -5149.56971093 hartree
oneelecener: -9049.39790123 hartree
twoeener: 3899.82819031 hartree
cpcmener: -0.03635199 hartree
kineticenergy: 1921.59656383 hartree
xcener: -157.111636773236 hartree
chargesum: -0.0000000
charge: -0.074332 -0.175124 -0.171467 -0.175354 -0.275366 -0.467284 -0.341791 -0.100432 0.085834 0.039747 -0.088792 -0.243025 -0.254999 -0.156113 0.417573 -0.090754 0.415565 0.510369 0.004030 -0.219328 -0.180156 -0.212806 0.263587 -0.131450 -0.218594 0.279741 -0.189237 -0.242600 -0.156766 -0.129565 -0.183619 0.097117 0.107620 0.106157 0.060179 0.108765 0.098452 0.092223 0.096626 0.149528 0.139480 0.148744 0.147333 0.163104 0.151489 0.164472 0.148003 0.161438 0.161053 0.160725
qa: -0.0743 -0.1751 -0.1715 -0.1754 -0.2754 -0.4673 -0.3418 -0.1004 0.0858 0.0397 -0.0888 -0.2430 -0.2550 -0.1561 0.4176 -0.0908 0.4156 0.5104 0.0040 -0.2193 -0.1802 -0.2128 0.2636 -0.1315 -0.2186 0.2797 -0.1892 -0.2426 -0.1568 -0.1296 -0.1836 0.0971 0.1076 0.1062 0.0602 0.1088 0.0985 0.0922 0.0966 0.1495 0.1395 0.1487 0.1473 0.1631 0.1515 0.1645 0.1480 0.1614 0.1611 0.1607
va: 1.2612 1.1233 1.1313 1.1226 2.1416 2.0246 2.0692 3.1104 3.7955 3.7806 3.9050 3.9130 3.9089 3.8460 4.1000 4.0084 3.7341 4.4822 3.5829 4.0669 3.9260 3.9798 3.7307 3.9035 4.0205 3.7094 3.8682 3.9957 3.8871 3.8865 3.9033 1.0269 1.0268 0.9998 1.0127 1.0025 1.0012 1.0054 1.0024 1.0203 1.0158 1.0118 1.0077 0.9883 1.0032 0.9895 1.0073 0.9908 0.9877 0.9892
dispcorr: -0.027310864 hartree
energy: -1928.200157313463
dipole: 32.06276 -31.72307 0.33970 -20.72737 20.11983 -0.60754 -14.10051 12.08671 -2.01380
magnitude: 2.13070 au
magnitude: 5.41581 debye
