program: Orca
programVersion: 5.0.2
elementType: Cl F F F O O O N C C C C C C C C C C C C C C C C C C C C C C C H H H H H H H H H H H H H H H H H H H
charge: 0
multiplicity: 1
keywords: wb97x-d3
keywords: def2-TZVPP
keywords: def2/J RIJCOSX
keywords: DEFGRID2
keywords: scfconv7
keywords: smallprint printgap noloewdin
keywords: NOSOSCF
formula: C23H19ClF3NO3
InChI: InChI=1/C23H19ClF3NO3/c1-22(2)17(12-19(24)23(25,26)27)20(22)21(29)31-18(13-28)14-7-6-10-16(11-14)30-15-8-4-3-5-9-15/h3-12,17-18,20H,1-2H3
50 atoms
Cl -3.961756 3.147732 -2.299042
F  -2.025402 5.438173 -2.398095
F  -1.075851 5.022826 -0.51179
F  -3.175239 5.48723 -0.589363
O  0.944003 -0.951213 -1.605764
O  0.935428 1.027637 -0.571054
O  2.657476 -3.562977 2.50279
N  3.095813 -2.745831 -3.350977
C  -1.955321 0.070231 0.255706
C  -2.154581 0.979421 -0.925884
C  -1.127184 -0.143544 -0.992243
C  -1.334331 0.586701 1.52964
C  -3.03151 -0.959114 0.498651
C  -1.800756 2.396792 -0.856041
C  0.325922 0.086475 -1.012516
C  -2.517666 3.385556 -1.379633
C  2.363887 -0.917401 -1.633003
C  -2.189722 4.834553 -1.216794
C  2.984701 -1.216728 -0.28793
C  2.750773 -1.945108 -2.601034
C  2.487585 -2.258805 0.484693
C  4.064992 -0.462696 0.14612
C  3.079437 -2.528986 1.71029
C  4.658803 -0.761634 1.363836
C  4.16598 -1.787217 2.154538
C  1.308325 -3.789978 2.645307
C  0.869232 -5.103776 2.59469
C  0.420418 -2.750248 2.888485
C  -0.477647 -5.378198 2.7917
C  -0.923541 -3.038697 3.074851
C  -1.379216 -4.349531 3.025385
H  -3.029524 0.758023 -1.525036
H  -1.439778 -0.979427 -1.606395
H  -2.120272 0.971001 2.180989
H  -0.836774 -0.226149 2.058791
H  -0.606339 1.381601 1.395867
H  -3.826196 -0.536728 1.115626
H  -3.478377 -1.311013 -0.431283
H  -2.624017 -1.82394 1.024734
H  -0.91376 2.681005 -0.307492
H  2.731664 0.0417 -2.011396
H  1.653922 -2.85618 0.134526
H  4.440389 0.349806 -0.462464
H  5.501874 -0.179496 1.710278
H  4.618736 -2.012599 3.111441
H  1.573854 -5.90359 2.407273
H  0.768211 -1.726008 2.939214
H  -0.82146 -6.403172 2.752909
H  -1.616245 -2.229449 3.265107
H  -2.42864 -4.566764 3.172156
elementType: Cl F O N C H
totalener: -1928.17294477 hartree
nucrepener: 3189.90774108 hartree
electener: -5118.08068585 hartree
oneelecener: -8986.11979835 hartree
twoeener: 3868.03911250 hartree
cpcmener: -0.03799198 hartree
kineticenergy: 1921.61268316 hartree
xcener: -157.115717460450 hartree
chargesum: 0.0000000
charge: -0.074235 -0.175008 -0.170889 -0.175363 -0.286039 -0.461340 -0.343072 -0.100245 0.097984 0.033279 -0.064772 -0.270217 -0.264997 -0.160787 0.395410 -0.088337 0.424887 0.510440 0.012779 -0.223596 -0.167458 -0.205458 0.218385 -0.121437 -0.222172 0.266567 -0.244641 -0.164831 -0.124374 -0.179605 -0.182643 0.096713 0.107409 0.109793 0.085245 0.100759 0.100850 0.094081 0.097009 0.146319 0.145818 0.150318 0.150475 0.162573 0.151859 0.148833 0.165727 0.161153 0.175654 0.161195
qa: -0.0742 -0.1750 -0.1709 -0.1754 -0.2860 -0.4613 -0.3431 -0.1002 0.0980 0.0333 -0.0648 -0.2702 -0.2650 -0.1608 0.3954 -0.0883 0.4249 0.5104 0.0128 -0.2236 -0.1675 -0.2055 0.2184 -0.1214 -0.2222 0.2666 -0.2446 -0.1648 -0.1244 -0.1796 -0.1826 0.0967 0.1074 0.1098 0.0852 0.1008 0.1009 0.0941 0.0970 0.1463 0.1458 0.1503 0.1505 0.1626 0.1519 0.1488 0.1657 0.1612 0.1757 0.1612
va: 1.2615 1.1241 1.1329 1.1218 2.1292 2.0361 2.0595 3.1108 3.7549 3.8083 3.8961 3.9045 3.9136 3.8536 4.1091 4.0106 3.7108 4.4850 3.6042 4.0889 3.9086 3.9750 3.7698 3.8976 4.0052 3.7074 4.0061 3.8674 3.8857 3.8714 3.9071 1.0274 1.0275 1.0009 1.0087 1.0167 1.0003 1.0073 1.0030 1.0296 1.0166 1.0158 1.0011 0.9880 1.0032 1.0064 0.9911 0.9874 0.9770 0.9905
dispcorr: -0.027592098 hartree
energy: -1928.200536862517
dipole: 9.49806 -10.40144 -0.90337 -41.95756 41.24680 -0.71076 25.86462 -24.19448 1.67014
magnitude: 2.02747 au
magnitude: 5.15342 debye
