program: Orca
programVersion: 5.0.2
elementType: Cl F F F O O O N C C C C C C C C C C C C C C C C C C C C C C C H H H H H H H H H H H H H H H H H H H
charge: 0
multiplicity: 1
keywords: wb97x-d3
keywords: def2-TZVPP
keywords: def2/J RIJCOSX
keywords: DEFGRID2
keywords: scfconv7
keywords: smallprint printgap noloewdin
keywords: NOSOSCF
formula: C23H19ClF3NO3
InChI: InChI=1/C23H19ClF3NO3/c1-22(2)17(12-19(24)23(25,26)27)20(22)21(29)31-18(13-28)14-7-6-10-16(11-14)30-15-8-4-3-5-9-15/h3-12,17-18,20H,1-2H3
50 atoms
Cl -3.886107 0.832278 0.004647
F  -3.189441 -1.316287 -1.843762
F  -1.292675 -0.55346 -2.51737
F  -3.119396 0.485593 -2.998147
O  1.780597 1.733755 -0.147133
O  2.395367 1.559649 1.986112
O  1.197476 -3.243536 0.266727
N  3.09993 1.437927 -3.147441
C  -0.592488 3.372139 0.824796
C  -1.117843 1.962006 0.861443
C  0.205664 2.303219 1.538239
C  -0.138922 3.987466 -0.477344
C  -1.267851 4.368488 1.736262
C  -1.229327 1.141977 -0.348595
C  1.551023 1.829685 1.167074
C  -2.365642 0.607433 -0.782924
C  3.043804 1.213784 -0.5450
C  -2.484841 -0.198607 -2.036782
C  3.220929 -0.234496 -0.151261
C  3.063644 1.353263 -2.001054
C  2.132402 -1.089965 -0.213237
C  4.452063 -0.686104 0.301746
C  2.266047 -2.386908 0.256196
C  4.584801 -2.006633 0.705584
C  3.489769 -2.858429 0.707159
C  -0.010222 -2.794423 0.749208
C  -1.148971 -3.375142 0.209987
C  -0.109842 -1.84575 1.762052
C  -2.396396 -3.014206 0.69888
C  -1.366233 -1.48513 2.228671
C  -2.512943 -2.065893 1.705257
H  -1.906801 1.792392 1.585289
H  0.121099 2.333683 2.617773
H  -0.971878 4.540799 -0.913074
H  0.669296 4.69868 -0.302024
H  0.197101 3.27467 -1.224627
H  -1.595582 3.911581 2.669984
H  -0.585188 5.183477 1.982371
H  -2.142099 4.801035 1.247526
H  -0.346495 0.971212 -0.949449
H  3.862423 1.81906 -0.142268
H  1.177509 -0.749443 -0.594885
H  5.29564 -0.009683 0.35214
H  5.540988 -2.367808 1.05928
H  3.58174 -3.876697 1.06254
H  -1.057862 -4.110568 -0.579356
H  0.771457 -1.387518 2.192468
H  -3.281643 -3.476633 0.283137
H  -1.441586 -0.745558 3.015187
H  -3.487435 -1.781407 2.077194
elementType: Cl F O N C H
totalener: -1928.16878994 hartree
nucrepener: 3463.09972339 hartree
electener: -5391.26851333 hartree
oneelecener: -9532.85022847 hartree
twoeener: 4141.58171514 hartree
cpcmener: -0.04082486 hartree
kineticenergy: 1921.60702672 hartree
xcener: -157.117822154577 hartree
chargesum: -0.0000000
charge: -0.077706 -0.172001 -0.175671 -0.174910 -0.271581 -0.459662 -0.339319 -0.096623 0.122336 -0.016473 -0.101882 -0.259331 -0.263575 -0.180468 0.419192 -0.058682 0.382417 0.524103 0.038872 -0.223686 -0.201846 -0.223272 0.243978 -0.107093 -0.227867 0.322781 -0.269073 -0.198006 -0.113941 -0.138425 -0.203944 0.105772 0.107774 0.099673 0.109232 0.090274 0.092406 0.099304 0.096294 0.160301 0.151797 0.159516 0.148409 0.162555 0.150741 0.145900 0.151197 0.156437 0.159305 0.154472
qa: -0.0777 -0.1720 -0.1757 -0.1749 -0.2716 -0.4597 -0.3393 -0.0966 0.1223 -0.0165 -0.1019 -0.2593 -0.2636 -0.1805 0.4192 -0.0587 0.3824 0.5241 0.0389 -0.2237 -0.2018 -0.2233 0.2440 -0.1071 -0.2279 0.3228 -0.2691 -0.1980 -0.1139 -0.1384 -0.2039 0.1058 0.1078 0.0997 0.1092 0.0903 0.0924 0.0993 0.0963 0.1603 0.1518 0.1595 0.1484 0.1626 0.1507 0.1459 0.1512 0.1564 0.1593 0.1545
va: 1.2534 1.1226 1.1228 1.1229 2.1303 2.0346 2.0763 3.1043 3.7892 3.7708 3.9465 3.9072 3.9119 3.8172 4.0966 3.9448 3.7497 4.4574 3.5376 4.0822 3.9540 3.9898 3.7652 3.8710 4.0067 3.6257 3.9853 3.8355 3.8207 3.8338 3.8433 1.0185 1.0226 1.0019 1.0009 1.0066 1.0055 1.0012 1.0024 1.0037 1.0116 0.9958 1.0011 0.9873 1.0032 1.0082 1.0073 0.9902 0.9904 0.9992
dispcorr: -0.033937275 hartree
energy: -1928.202727213846
dipole: 16.88205 -16.71950 0.16255 13.58244 -12.18456 1.39788 22.15553 -20.06042 2.09511
magnitude: 2.52388 au
magnitude: 6.41519 debye
