program: Orca
programVersion: 5.0.2
elementType: Cl F F F O O O N C C C C C C C C C C C C C C C C C C C C C C C H H H H H H H H H H H H H H H H H H H
charge: 0
multiplicity: 1
keywords: wb97x-d3
keywords: def2-TZVPP
keywords: def2/J RIJCOSX
keywords: DEFGRID2
keywords: scfconv7
keywords: smallprint printgap noloewdin
keywords: NOSOSCF
formula: C23H19ClF3NO3
InChI: InChI=1/C23H19ClF3NO3/c1-22(2)17(12-19(24)23(25,26)27)20(22)21(29)31-18(13-28)14-7-6-10-16(11-14)30-15-8-4-3-5-9-15/h3-12,17-18,20H,1-2H3
50 atoms
Cl -3.552959 3.957703 -1.111936
F  -4.078388 0.701634 0.931138
F  -5.493906 1.956424 -0.09342
F  -4.362664 2.743882 1.551112
O  2.186669 1.597391 -0.011939
O  0.333207 0.447501 0.4874
O  2.644954 -3.945412 0.950669
N  4.77604 2.584466 1.782589
C  -0.329854 1.093083 -2.514074
C  -1.093797 2.093682 -1.69355
C  0.395288 1.878714 -1.44114
C  -0.575835 -0.388087 -2.367907
C  -0.014489 1.496452 -3.933463
C  -2.131996 1.683725 -0.74749
C  0.912536 1.223733 -0.230033
C  -3.219562 2.391023 -0.459456
C  2.879957 0.943797 1.051937
C  -4.28746 1.939141 0.484484
C  3.423494 -0.38671 0.594233
C  3.94369 1.866327 1.444836
C  2.813961 -1.546233 1.047517
C  4.465031 -0.449775 -0.32615
C  3.226864 -2.773732 0.546179
C  4.893822 -1.684978 -0.78372
C  4.270304 -2.851457 -0.362528
C  1.278113 -3.999331 1.092778
C  0.414615 -3.332846 0.230306
C  0.784259 -4.79535 2.115926
C  -0.954576 -3.460547 0.413736
C  -0.588165 -4.923173 2.278162
C  -1.463226 -4.251694 1.435469
H  -1.2800 3.037653 -2.191413
H  1.023295 2.682441 -1.806196
H  -1.391851 -0.684541 -3.028448
H  0.312843 -0.942091 -2.674112
H  -0.834131 -0.714206 -1.3645
H  -0.851085 1.251864 -4.589848
H  0.180441 2.565299 -4.021362
H  0.864097 0.961969 -4.298088
H  -2.037055 0.722087 -0.263161
H  2.232427 0.81368 1.924036
H  2.01375 -1.489338 1.774733
H  4.944622 0.453075 -0.683902
H  5.710335 -1.744044 -1.490711
H  4.591373 -3.814661 -0.737724
H  0.793237 -2.720921 -0.579129
H  1.468285 -5.311344 2.777844
H  -1.625826 -2.937135 -0.25509
H  -0.971211 -5.544727 3.076859
H  -2.532194 -4.345393 1.571709
elementType: Cl F O N C H
totalener: -1928.17305209 hartree
nucrepener: 3209.26445244 hartree
electener: -5137.43750453 hartree
oneelecener: -9025.10613994 hartree
twoeener: 3887.66863541 hartree
cpcmener: -0.03635214 hartree
kineticenergy: 1921.59142567 hartree
xcener: -157.110730731523 hartree
chargesum: -0.0000000
charge: -0.073858 -0.171307 -0.175457 -0.174938 -0.279127 -0.469894 -0.340603 -0.101340 0.086954 0.035596 -0.089353 -0.253107 -0.253466 -0.149264 0.427212 -0.089841 0.419255 0.510205 -0.001397 -0.218010 -0.179762 -0.212880 0.270525 -0.130308 -0.222047 0.290375 -0.205987 -0.249162 -0.147165 -0.125403 -0.189180 0.096573 0.107711 0.108981 0.107745 0.057455 0.098502 0.092477 0.097229 0.147211 0.136482 0.147787 0.147073 0.163240 0.150616 0.168756 0.148234 0.164564 0.161340 0.160757
qa: -0.0739 -0.1713 -0.1755 -0.1749 -0.2791 -0.4699 -0.3406 -0.1013 0.0870 0.0356 -0.0894 -0.2531 -0.2535 -0.1493 0.4272 -0.0898 0.4193 0.5102 -0.0014 -0.2180 -0.1798 -0.2129 0.2705 -0.1303 -0.2220 0.2904 -0.2060 -0.2492 -0.1472 -0.1254 -0.1892 0.0966 0.1077 0.1090 0.1077 0.0575 0.0985 0.0925 0.0972 0.1472 0.1365 0.1478 0.1471 0.1632 0.1506 0.1688 0.1482 0.1646 0.1613 0.1608
va: 1.2617 1.1327 1.1240 1.1218 2.1411 2.0205 2.0725 3.1096 3.8025 3.7835 3.8963 3.9153 3.9052 3.8526 4.0875 4.0158 3.7277 4.4841 3.6185 4.0656 3.9193 3.9881 3.7288 3.9048 4.0249 3.7089 3.8878 4.0011 3.8758 3.8829 3.9155 1.0280 1.0272 1.0022 0.9978 1.0133 1.0012 1.0052 1.0022 1.0203 1.0191 1.0132 1.0071 0.9883 1.0037 0.9860 1.0073 0.9877 0.9874 0.9897
dispcorr: -0.027062524 hartree
energy: -1928.200114610306
dipole: 29.60618 -29.40632 0.19986 -27.35468 26.21108 -1.14360 -16.84995 14.61533 -2.23462
magnitude: 2.51819 au
magnitude: 6.40074 debye
