program: Orca
programVersion: 5.0.2
elementType: Cl F F F O O O N C C C C C C C C C C C C C C C C C C C C C C C H H H H H H H H H H H H H H H H H H H
charge: 0
multiplicity: 1
keywords: wb97x-d3
keywords: def2-TZVPP
keywords: def2/J RIJCOSX
keywords: DEFGRID2
keywords: scfconv7
keywords: smallprint printgap noloewdin
keywords: NOSOSCF
formula: C23H19ClF3NO3
InChI: InChI=1/C23H19ClF3NO3/c1-22(2)17(12-19(24)23(25,26)27)20(22)21(29)31-18(13-28)14-7-6-10-16(11-14)30-15-8-4-3-5-9-15/h3-12,17-18,20H,1-2H3
50 atoms
Cl -1.795032 1.487074 3.082402
F  -2.319985 -1.20003 1.887996
F  -3.177355 -0.487529 0.043294
F  -4.128413 -0.047596 1.923356
O  2.528673 1.99483 -0.048783
O  0.730922 1.027572 -0.953174
O  1.428714 -3.661041 0.090842
N  3.380091 0.509124 -2.996767
C  -0.518081 3.883193 -0.618387
C  -0.954466 3.063245 0.550622
C  0.527936 3.13157 0.183836
C  -0.861791 3.488159 -2.031969
C  -0.500129 5.379791 -0.417251
C  -1.713942 1.813544 0.40952
C  1.216197 1.944867 -0.339524
C  -2.137688 1.087607 1.437194
C  3.335218 0.877548 -0.407889
C  -2.943852 -0.164253 1.314574
C  2.993449 -0.361426 0.38769
C  3.31962 0.669707 -1.859283
C  2.378504 -1.461432 -0.191208
C  3.288373 -0.354541 1.746413
C  2.030837 -2.545587 0.603616
C  2.953257 -1.452681 2.523133
C  2.314721 -2.54767 1.961748
C  0.60852 -3.536527 -1.008382
C  0.812786 -4.407518 -2.066418
C  -0.420006 -2.603137 -1.038105
C  -0.026725 -4.343476 -3.170686
C  -1.243862 -2.543278 -2.151945
C  -1.050592 -3.408371 -3.221513
H  -1.171003 3.617429 1.457279
H  1.132258 3.739393 0.845743
H  -1.838861 3.89813 -2.291836
H  -0.133124 3.912848 -2.723841
H  -0.897483 2.417261 -2.212046
H  0.249061 5.845148 -1.059625
H  -1.471592 5.807133 -0.670849
H  -0.273814 5.650943 0.614295
H  -1.975363 1.471677 -0.583556
H  4.350044 1.194587 -0.157007
H  2.165315 -1.476718 -1.252284
H  3.779053 0.499348 2.195841
H  3.183889 -1.455302 3.579855
H  2.04227 -3.400164 2.570607
H  1.617782 -5.130251 -2.026179
H  -0.578516 -1.932203 -0.203429
H  0.13004 -5.024507 -3.996673
H  -2.044028 -1.815916 -2.181199
H  -1.698013 -3.355995 -4.086447
elementType: Cl F O N C H
totalener: -1928.17185813 hartree
nucrepener: 3367.69412036 hartree
electener: -5295.86597849 hartree
oneelecener: -9344.04142292 hartree
twoeener: 4048.17544443 hartree
cpcmener: -0.03911742 hartree
kineticenergy: 1921.61289967 hartree
xcener: -157.116350620909 hartree
chargesum: 0.0000000
charge: -0.072426 -0.177782 -0.172254 -0.173968 -0.286534 -0.474567 -0.339231 -0.093850 0.085476 -0.059903 -0.065140 -0.276803 -0.252580 -0.092171 0.447394 -0.098434 0.489413 0.528254 -0.024635 -0.246986 -0.162390 -0.259298 0.255778 -0.109235 -0.241449 0.264921 -0.230400 -0.184760 -0.136171 -0.148008 -0.173855 0.110139 0.100950 0.106114 0.104210 0.093516 0.099698 0.097841 0.091833 0.149652 0.147797 0.136063 0.146707 0.162643 0.149962 0.148358 0.155038 0.161100 0.158175 0.161798
qa: -0.0724 -0.1778 -0.1723 -0.1740 -0.2865 -0.4746 -0.3392 -0.0939 0.0855 -0.0599 -0.0651 -0.2768 -0.2526 -0.0922 0.4474 -0.0984 0.4894 0.5283 -0.0246 -0.2470 -0.1624 -0.2593 0.2558 -0.1092 -0.2414 0.2649 -0.2304 -0.1848 -0.1362 -0.1480 -0.1739 0.1101 0.1009 0.1061 0.1042 0.0935 0.0997 0.0978 0.0918 0.1497 0.1478 0.1361 0.1467 0.1626 0.1500 0.1484 0.1550 0.1611 0.1582 0.1618
va: 1.2635 1.1174 1.1300 1.1287 2.1447 2.0164 2.0726 3.1032 3.8441 3.8347 3.8993 3.9018 3.8916 3.7962 4.0271 4.0015 3.8205 4.4516 3.6603 4.0803 3.8621 3.9929 3.7929 3.8818 4.0133 3.7329 3.9982 3.9126 3.8836 3.8870 3.9080 1.0201 1.0285 0.9992 0.9995 1.0178 1.0018 1.0020 1.0047 1.0095 0.9914 1.0194 1.0055 0.9872 1.0047 1.0059 0.9967 0.9881 0.9980 0.9894
dispcorr: -0.028639880 hartree
energy: -1928.200498010470
dipole: 16.24744 -15.67455 0.57288 13.83070 -11.31048 2.52022 -19.92352 21.06789 1.14437
magnitude: 2.82653 au
magnitude: 7.18447 debye
