program: Orca
programVersion: 5.0.2
elementType: Cl F F F O O O N C C C C C C C C C C C C C C C C C C C C C C C H H H H H H H H H H H H H H H H H H H
charge: 0
multiplicity: 1
keywords: wb97x-d3
keywords: def2-TZVPP
keywords: def2/J RIJCOSX
keywords: DEFGRID2
keywords: scfconv7
keywords: smallprint printgap noloewdin
keywords: NOSOSCF
formula: C23H19ClF3NO3
InChI: InChI=1/C23H19ClF3NO3/c1-22(2)17(12-19(24)23(25,26)27)20(22)21(29)31-18(13-28)14-7-6-10-16(11-14)30-15-8-4-3-5-9-15/h3-12,17-18,20H,1-2H3
50 atoms
Cl -4.033913 1.032947 -0.191336
F  -3.253262 -1.348377 -1.82445
F  -1.650631 -0.396502 -2.897696
F  -3.664544 0.336933 -3.091202
O  2.315156 1.488048 1.42353
O  1.690573 1.687338 -0.706916
O  1.320488 -3.461269 0.681726
N  4.970597 2.628158 -0.331838
C  -0.603606 3.463963 0.424073
C  -1.186578 2.081285 0.494124
C  0.201634 2.355884 1.065932
C  -0.217203 4.062111 -0.905061
C  -1.165369 4.479872 1.388627
C  -1.392231 1.253774 -0.698557
C  1.430996 1.821745 0.462518
C  -2.565978 0.747342 -1.059589
C  3.535912 0.897077 1.005377
C  -2.775876 -0.163718 -2.225817
C  3.341834 -0.426224 0.293638
C  4.32057 1.861369 0.226725
C  2.42413 -1.318824 0.835961
C  4.062701 -0.764722 -0.841948
C  2.200612 -2.532348 0.202461
C  3.855549 -2.000138 -1.439568
C  2.917253 -2.882816 -0.934935
C  0.178231 -3.075151 1.341137
C  -0.184973 -3.826474 2.449081
C  -0.6225 -2.030481 0.894216
C  -1.361621 -3.527631 3.121234
C  -1.788275 -1.735023 1.586392
C  -2.162996 -2.476708 2.699096
H  -1.928303 1.940951 1.272139
H  0.225732 2.372628 2.148506
H  -1.075296 4.596998 -1.3143
H  0.588929 4.785562 -0.776215
H  0.099023 3.337906 -1.649839
H  -1.440951 4.02934 2.342231
H  -0.43285 5.264049 1.585851
H  -2.055253 4.951354 0.969091
H  -0.543056 1.02653 -1.329691
H  4.087572 0.731959 1.93476
H  1.883247 -1.0658 1.739469
H  4.781756 -0.081261 -1.2738
H  4.417615 -2.267278 -2.3242
H  2.740377 -3.836673 -1.414805
H  0.446492 -4.641713 2.778402
H  -0.350024 -1.451601 0.020115
H  -1.645112 -4.116875 3.983276
H  -2.412808 -0.919343 1.248523
H  -3.075501 -2.238821 3.228972
elementType: Cl F O N C H
totalener: -1928.17200630 hartree
nucrepener: 3359.98844820 hartree
electener: -5288.16045450 hartree
oneelecener: -9326.83138771 hartree
twoeener: 4038.67093322 hartree
cpcmener: -0.03819671 hartree
kineticenergy: 1921.59700749 hartree
xcener: -157.117015563449 hartree
chargesum: 0.0000000
charge: -0.079617 -0.174984 -0.173384 -0.174068 -0.294276 -0.462745 -0.337608 -0.091067 0.114359 -0.000409 -0.080383 -0.273301 -0.257652 -0.185107 0.421226 -0.060609 0.545744 0.519741 -0.042630 -0.263543 -0.269381 -0.209224 0.300779 -0.104082 -0.252594 0.311931 -0.268151 -0.220315 -0.101976 -0.096689 -0.233596 0.105181 0.106777 0.101660 0.107717 0.097923 0.092808 0.099435 0.097341 0.156048 0.149654 0.146184 0.135640 0.162431 0.149486 0.147313 0.160381 0.161201 0.158153 0.158279
qa: -0.0796 -0.1750 -0.1734 -0.1741 -0.2943 -0.4627 -0.3376 -0.0911 0.1144 -0.0004 -0.0804 -0.2733 -0.2577 -0.1851 0.4212 -0.0606 0.5457 0.5197 -0.0426 -0.2635 -0.2694 -0.2092 0.3008 -0.1041 -0.2526 0.3119 -0.2682 -0.2203 -0.1020 -0.0967 -0.2336 0.1052 0.1068 0.1017 0.1077 0.0979 0.0928 0.0994 0.0973 0.1560 0.1497 0.1462 0.1356 0.1624 0.1495 0.1473 0.1604 0.1612 0.1582 0.1583
va: 1.2548 1.1201 1.1321 1.1271 2.1347 2.0243 2.0800 3.1037 3.8132 3.8010 3.9692 3.9028 3.9028 3.7725 4.0256 3.9503 3.7768 4.4766 3.7364 4.1087 3.9617 3.9344 3.7101 3.9097 4.0202 3.7147 4.0201 3.9114 3.8579 3.8040 3.9819 1.0187 1.0275 1.0013 0.9997 1.0128 1.0052 1.0017 1.0022 1.0245 0.9878 1.0143 1.0171 0.9882 1.0052 1.0077 0.9974 0.9869 0.9933 0.9921
dispcorr: -0.029941126 hartree
energy: -1928.201947422176
dipole: 17.41797 -17.90015 -0.48218 11.28019 -11.01016 0.27003 19.85371 -17.34532 2.50838
magnitude: 2.56854 au
magnitude: 6.52871 debye
