program: Orca
programVersion: 5.0.2
elementType: Cl F F F O O O N C C C C C C C C C C C C C C C C C C C C C C C H H H H H H H H H H H H H H H H H H H
charge: 0
multiplicity: 1
keywords: wb97x-d3
keywords: def2-TZVPP
keywords: def2/J RIJCOSX
keywords: DEFGRID2
keywords: scfconv7
keywords: smallprint printgap noloewdin
keywords: NOSOSCF
formula: C23H19ClF3NO3
InChI: InChI=1/C23H19ClF3NO3/c1-22(2)17(12-19(24)23(25,26)27)20(22)21(29)31-18(13-28)14-7-6-10-16(11-14)30-15-8-4-3-5-9-15/h3-12,17-18,20H,1-2H3
50 atoms
Cl -4.054829 3.131205 -2.244786
F  -0.692565 4.950945 -1.588118
F  -2.692143 5.684756 -1.273477
F  -2.069618 5.082342 -3.23626
O  0.686863 -1.141303 -1.397451
O  0.88788 1.014898 -0.857491
O  2.812863 -2.998475 2.953749
N  2.546656 -3.415145 -2.891474
C  -1.858667 0.420073 0.567983
C  -2.191951 1.11602 -0.722577
C  -1.249996 -0.08167 -0.72415
C  -1.016474 1.085779 1.626579
C  -2.941757 -0.456846 1.145801
C  -1.733017 2.471684 -1.023533
C  0.191928 0.039152 -0.986302
C  -2.447534 3.390531 -1.662868
C  2.099035 -1.205391 -1.572009
C  -1.966399 4.778226 -1.938359
C  2.828995 -1.214803 -0.250033
C  2.333785 -2.447655 -2.308272
C  2.459878 -2.139993 0.720335
C  3.829896 -0.287368 -0.006974
C  3.094738 -2.112531 1.953308
C  4.47129 -0.289139 1.224526
C  4.102602 -1.188995 2.209239
C  1.564574 -3.571815 3.039751
C  1.503362 -4.948917 3.186293
C  0.409368 -2.799831 3.047076
C  0.268039 -5.562575 3.344803
C  -0.818351 -3.427766 3.196849
C  -0.895717 -4.806946 3.345621
H  -3.164599 0.865503 -1.128205
H  -1.689799 -0.990615 -1.11628
H  -0.494371 0.329887 2.217111
H  -0.271681 1.780472 1.247672
H  -1.665475 1.641678 2.304972
H  -3.615362 0.134343 1.767944
H  -3.535812 -0.938646 0.368939
H  -2.507758 -1.238123 1.771316
H  -0.745786 2.766406 -0.69742
H  2.458521 -0.382756 -2.198567
H  1.684961 -2.868505 0.513245
H  4.103237 0.431927 -0.767812
H  5.253442 0.430015 1.426674
H  4.592129 -1.180584 3.174693
H  2.413745 -5.534682 3.180876
H  0.460357 -1.722579 2.940956
H  0.219436 -6.637402 3.460069
H  -1.720795 -2.830622 3.206709
H  -1.857419 -5.287436 3.465786
elementType: Cl F O N C H
totalener: -1928.17320263 hartree
nucrepener: 3182.24616531 hartree
electener: -5110.41936794 hartree
oneelecener: -8970.88304203 hartree
twoeener: 3860.46367409 hartree
cpcmener: -0.03822994 hartree
kineticenergy: 1921.61283889 hartree
xcener: -157.115101183594 hartree
chargesum: -0.0000000
charge: -0.074589 -0.171453 -0.175184 -0.175285 -0.283829 -0.463044 -0.335875 -0.099454 0.073403 0.027947 -0.053302 -0.262475 -0.250105 -0.161854 0.391998 -0.085040 0.430542 0.510926 0.016428 -0.226555 -0.211417 -0.216099 0.267224 -0.108023 -0.243775 0.263483 -0.225525 -0.205462 -0.134320 -0.170453 -0.176914 0.097515 0.106184 0.097263 0.096720 0.106028 0.099634 0.094178 0.086988 0.148563 0.144192 0.146311 0.149819 0.162008 0.151237 0.148875 0.191081 0.161216 0.178908 0.161361
qa: -0.0746 -0.1715 -0.1752 -0.1753 -0.2838 -0.4630 -0.3359 -0.0995 0.0734 0.0279 -0.0533 -0.2625 -0.2501 -0.1619 0.3920 -0.0850 0.4305 0.5109 0.0164 -0.2266 -0.2114 -0.2161 0.2672 -0.1080 -0.2438 0.2635 -0.2255 -0.2055 -0.1343 -0.1705 -0.1769 0.0975 0.1062 0.0973 0.0967 0.1060 0.0996 0.0942 0.0870 0.1486 0.1442 0.1463 0.1498 0.1620 0.1512 0.1489 0.1911 0.1612 0.1789 0.1614
va: 1.2607 1.1327 1.1210 1.1244 2.1376 2.0331 2.0746 3.1115 3.7885 3.8112 3.8859 3.8992 3.9085 3.8542 4.1183 4.0065 3.7175 4.4841 3.6049 4.0862 3.9360 3.9656 3.7447 3.8925 4.0066 3.7230 3.9938 3.9200 3.8846 3.9002 3.9124 1.0269 1.0270 1.0032 1.0128 1.0012 1.0025 1.0060 1.0105 1.0300 1.0154 1.0168 1.0032 0.9879 1.0048 1.0061 0.9686 0.9881 0.9798 0.9901
dispcorr: -0.027060526 hartree
energy: -1928.200263151180
dipole: 10.40560 -11.21216 -0.80656 -39.09392 38.58359 -0.51033 31.94410 -30.06440 1.87969
magnitude: 2.10813 au
magnitude: 5.35845 debye
