program: Orca
programVersion: 5.0.2
elementType: Cl Cl O O O N C C C C C C C C C C C C C C C C C C C C C C H H H H H H H H H H H H H H H H H H H
charge: 0
multiplicity: 1
keywords: wb97x-d3
keywords: def2-TZVPP
keywords: def2/J RIJCOSX
keywords: DEFGRID2
keywords: scfconv7
keywords: smallprint printgap noloewdin
keywords: NOSOSCF
formula: C22H19Cl2NO3
InChI: InChI=1/C22H19Cl2NO3/c1-22(2)17(12-19(23)24)20(22)21(26)28-18(13-25)14-7-6-10-16(11-14)27-15-8-4-3-5-9-15/h3-12,17-18,20H,1-2H3
47 atoms
Cl -0.937039 -6.184959 1.455819
Cl -3.762369 -5.704279 1.777166
O  0.378248 -0.081687 0.859647
O  1.610471 -1.889589 0.383936
O  1.740733 4.09241 -2.191732
N  0.786293 2.341017 3.076231
C  -0.892225 -2.666958 -1.33359
C  -0.92454 -3.406217 -0.029287
C  -0.747587 -1.898388 -0.035226
C  0.296599 -2.883917 -2.238451
C  -2.174296 -2.434346 -2.097442
C  -2.160325 -3.973355 0.523913
C  0.545213 -1.3362 0.404993
C  -2.262108 -5.132033 1.163837
C  1.552947 0.607891 1.27774
C  2.23342 1.288999 0.116312
C  1.109489 1.572546 2.286331
C  1.640711 2.402593 -0.468848
C  3.42013 0.77546 -0.381989
C  2.258461 3.015256 -1.549104
C  4.022975 1.392159 -1.469509
C  3.452968 2.508452 -2.051748
C  0.859918 4.919467 -1.546248
C  -0.375751 5.137902 -2.133106
C  1.211206 5.565418 -0.368116
C  -1.266865 6.018924 -1.53756
C  0.307997 6.434417 0.222545
C  -0.931498 6.665045 -0.35791
H  -0.018861 -3.957139 0.196749
H  -1.610068 -1.305942 0.248235
H  0.50746 -1.986182 -2.822369
H  0.074028 -3.690048 -2.939352
H  1.200894 -3.152728 -1.699207
H  -2.050779 -1.605502 -2.795704
H  -3.021189 -2.191455 -1.456845
H  -2.439644 -3.320742 -2.675724
H  -3.076652 -3.407121 0.412457
H  2.25073 -0.083631 1.759611
H  0.710655 2.794605 -0.074642
H  3.866058 -0.101882 0.066478
H  4.950481 1.000296 -1.864598
H  3.923339 2.997421 -2.89469
H  -0.629269 4.627627 -3.052919
H  2.180313 5.393279 0.082632
H  -2.230604 6.193344 -1.997159
H  0.578647 6.936127 1.141866
H  -1.630136 7.34696 0.107263
totalener: -2050.66226460 hartree
nucrepener: 2693.56236502 hartree
electener: -4744.22462962 hartree
oneelecener: -8162.53128440 hartree
twoeener: 3418.30665479 hartree
kineticenergy: 2044.53215742 hartree
xcener: -151.870715579120 hartree
chargesum: 0.0000000
charge: -0.038677 -0.043862 -0.262538 -0.382877 -0.295931 -0.003501 0.066712 0.040696 -0.091399 -0.245948 -0.247868 -0.203004 0.363060 0.051649 0.329256 -0.007393 -0.265738 -0.170261 -0.134998 0.217376 -0.090658 -0.201006 0.225269 -0.193266 -0.157557 -0.101817 -0.103954 -0.133429 0.087548 0.082687 0.090028 0.089149 0.101510 0.094953 0.074013 0.099747 0.096910 0.122135 0.126108 0.118121 0.127882 0.128497 0.125325 0.133541 0.126263 0.129539 0.127708
qa: -0.0387 -0.0439 -0.2625 -0.3829 -0.2959 -0.0035 0.0667 0.0407 -0.0914 -0.2459 -0.2479 -0.2030 0.3631 0.0516 0.3293 -0.0074 -0.2657 -0.1703 -0.1350 0.2174 -0.0907 -0.2010 0.2253 -0.1933 -0.1576 -0.1018 -0.1040 -0.1334 0.0875 0.0827 0.0900 0.0891 0.1015 0.0950 0.0740 0.0997 0.0969 0.1221 0.1261 0.1181 0.1279 0.1285 0.1253 0.1335 0.1263 0.1295 0.1277
va: 1.2886 1.2611 2.1366 2.1210 2.1139 3.1164 3.7576 3.8322 3.8700 3.9156 3.9112 3.9226 4.2294 4.2526 3.8301 3.6863 4.0300 3.9683 3.9816 3.8604 3.9564 4.0318 3.8159 4.0391 3.9756 3.9368 3.9504 3.9560 1.0494 1.0353 1.0015 1.0014 1.0211 1.0040 1.0104 1.0024 1.0315 1.0187 1.0190 1.0209 0.9996 1.0122 1.0124 1.0031 0.9993 0.9997 0.9999
dispcorr: -0.023218666 hartree
energy: -2050.685483261705
dipole: 8.15565 -8.26117 -0.10552 29.43412 -29.28214 0.15198 -22.71288 21.27458 -1.43831
magnitude: 1.45016 au
magnitude: 3.68601 debye
