program: Orca
programVersion: 5.0.2
elementType: Cl Cl O O O N C C C C C C C C C C C C C C C C C C C C C C H H H H H H H H H H H H H H H H H H H
charge: 0
multiplicity: 1
keywords: wb97x-d3
keywords: def2-TZVPP
keywords: def2/J RIJCOSX
keywords: DEFGRID2
keywords: scfconv7
keywords: smallprint printgap noloewdin
keywords: NOSOSCF
formula: C22H19Cl2NO3
InChI: InChI=1/C22H19Cl2NO3/c1-22(2)17(12-19(23)24)20(22)21(26)28-18(13-25)14-7-6-10-16(11-14)27-15-8-4-3-5-9-15/h3-12,17-18,20H,1-2H3
47 atoms
Cl -2.353045 -0.048399 1.050167
Cl -4.100273 -0.184742 -1.237393
O  1.778626 -1.714038 0.498505
O  2.67968 -2.188913 -1.492228
O  0.608796 2.985865 -1.049428
N  2.82933 -0.556068 3.411024
C  -0.363626 -3.824264 -0.439033
C  -0.83002 -2.406898 -0.287659
C  0.393896 -2.71017 -1.12975
C  0.213958 -4.503409 0.779206
C  -1.109834 -4.772511 -1.346264
C  -2.027144 -1.847221 -0.925286
C  1.735042 -2.205864 -0.757757
C  -2.72763 -0.83304 -0.429785
C  2.916654 -0.937209 0.827234
C  2.916913 0.39266 0.105478
C  2.852875 -0.735844 2.276834
C  1.724303 1.084365 -0.069387
C  4.10966 0.90166 -0.38066
C  1.738119 2.292973 -0.75303
C  4.111871 2.118635 -1.044696
C  2.933145 2.816699 -1.233207
C  -0.440788 3.057432 -0.176671
C  -0.263654 3.212394 1.19175
C  -1.714288 3.046938 -0.727671
C  -1.377765 3.364975 2.004088
C  -2.816368 3.214202 0.094861
C  -2.654378 3.374133 1.462638
H  -0.605828 -1.979728 0.681012
H  0.265393 -2.687642 -2.20627
H  0.937148 -5.267286 0.488216
H  -0.581285 -4.997066 1.339662
H  0.709739 -3.81289 1.45803
H  -0.464598 -5.600221 -1.64371
H  -1.465698 -4.298557 -2.260573
H  -1.975237 -5.19252 -0.831372
H  -2.354019 -2.253827 -1.874144
H  3.840936 -1.478763 0.599257
H  0.789571 0.684041 0.30597
H  5.030573 0.346794 -0.256551
H  5.039238 2.522137 -1.427941
H  2.923778 3.760449 -1.761972
H  0.729114 3.226161 1.623158
H  -1.832561 2.917004 -1.79526
H  -1.23942 3.4873 3.070235
H  -3.807981 3.202748 -0.337023
H  -3.516794 3.496758 2.103464
totalener: -2050.65574515 hartree
nucrepener: 2958.02677235 hartree
electener: -5008.68251750 hartree
oneelecener: -8691.56542006 hartree
twoeener: 3682.88290256 hartree
kineticenergy: 2044.54347384 hartree
xcener: -151.876305153727 hartree
chargesum: 0.0000000
charge: -0.040589 -0.052495 -0.285181 -0.324176 -0.296114 0.001131 0.063601 0.043165 -0.050559 -0.245010 -0.259308 -0.213086 0.303309 0.079888 0.274887 0.075551 -0.257762 -0.186675 -0.163830 0.247721 -0.077912 -0.214134 0.295917 -0.179380 -0.239579 -0.108198 -0.098074 -0.149735 0.088281 0.086552 0.092958 0.091390 0.094285 0.096229 0.074072 0.099795 0.099479 0.128457 0.109144 0.105591 0.126920 0.128839 0.133734 0.123548 0.129893 0.122816 0.124642
qa: -0.0406 -0.0525 -0.2852 -0.3242 -0.2961 0.0011 0.0636 0.0432 -0.0506 -0.2450 -0.2593 -0.2131 0.3033 0.0799 0.2749 0.0756 -0.2578 -0.1867 -0.1638 0.2477 -0.0779 -0.2141 0.2959 -0.1794 -0.2396 -0.1082 -0.0981 -0.1497 0.0883 0.0866 0.0930 0.0914 0.0943 0.0962 0.0741 0.0998 0.0995 0.1285 0.1091 0.1056 0.1269 0.1288 0.1337 0.1235 0.1299 0.1228 0.1246
va: 1.2952 1.2544 2.0837 2.1828 2.1197 3.1165 3.8023 3.7588 3.7911 3.9125 3.9191 3.9611 4.2928 4.2227 3.8679 3.6529 4.0073 3.9864 4.0414 3.8233 3.9464 4.0415 3.7312 3.9442 3.9818 3.9184 3.8865 3.9258 1.0466 1.0288 1.0016 1.0028 1.0147 1.0039 1.0094 1.0016 1.0313 1.0154 1.0269 1.0131 0.9999 1.0123 1.0046 1.0168 0.9994 1.0056 1.0011
dispcorr: -0.029063560 hartree
energy: -2050.684808707362
dipole: 10.79448 -11.15178 -0.35730 -12.93173 12.29404 -0.63768 -2.10538 1.24873 -0.85665
magnitude: 1.12612 au
magnitude: 2.86237 debye
