program: Orca
programVersion: 5.0.2
elementType: Cl Cl O O O N C C C C C C C C C C C C C C C C C C C C C C H H H H H H H H H H H H H H H H H H H
charge: 0
multiplicity: 1
keywords: wb97x-d3
keywords: def2-TZVPP
keywords: def2/J RIJCOSX
keywords: DEFGRID2
keywords: scfconv7
keywords: smallprint printgap noloewdin
keywords: NOSOSCF
formula: C22H19Cl2NO3
InChI: InChI=1/C22H19Cl2NO3/c1-22(2)17(12-19(23)24)20(22)21(26)28-18(13-25)14-7-6-10-16(11-14)27-15-8-4-3-5-9-15/h3-12,17-18,20H,1-2H3
47 atoms
Cl -2.613717 -5.731204 1.532342
Cl -5.07246 -4.309353 1.013438
O  0.93425 -0.26122 -0.009798
O  1.365305 -2.115939 1.170296
O  1.736965 4.548885 -2.054084
N  1.451895 1.561215 2.779966
C  -0.508841 -3.335128 -1.065952
C  -1.205251 -3.272864 0.262133
C  -0.537353 -2.034971 -0.280718
C  0.758704 -4.146764 -1.167437
C  -1.339081 -3.361604 -2.326444
C  -2.674673 -3.314004 0.369282
C  0.674428 -1.521022 0.391025
C  -3.358612 -4.319694 0.900098
C  2.084665 0.370206 0.537496
C  2.611062 1.362852 -0.46516
C  1.721647 1.026725 1.799411
C  1.879206 2.507095 -0.763314
C  3.818515 1.111689 -1.095568
C  2.379469 3.413176 -1.687175
C  4.300074 2.016097 -2.03225
C  3.591804 3.164592 -2.325901
C  0.764372 5.09588 -1.260514
C  -0.454191 5.389654 -1.851175
C  1.002083 5.408224 0.071578
C  -1.445461 6.004133 -1.100465
C  -0.001774 6.009868 0.813967
C  -1.226637 6.308934 0.234159
H  -0.669599 -3.754062 1.0738
H  -1.179262 -1.264716 -0.694715
H  1.412229 -3.749527 -1.946634
H  0.511166 -5.174301 -1.438219
H  1.32096 -4.177807 -0.237493
H  -0.749523 -3.0183 -3.1778
H  -2.225549 -2.73115 -2.26539
H  -1.674613 -4.37778 -2.539246
H  -3.248781 -2.474995 -0.004509
H  2.856271 -0.370335 0.765682
H  0.933681 2.690545 -0.267878
H  4.384403 0.219831 -0.858466
H  5.242401 1.828469 -2.528836
H  3.966548 3.879517 -3.046314
H  -0.616088 5.144902 -2.892628
H  1.958453 5.184096 0.526558
H  -2.395709 6.237031 -1.562274
H  0.179273 6.24829 1.853365
H  -2.003482 6.781993 0.819174
totalener: -2050.66107893 hartree
nucrepener: 2668.54462837 hartree
electener: -4719.20570730 hartree
oneelecener: -8112.44488242 hartree
twoeener: 3393.23917512 hartree
kineticenergy: 2044.52882847 hartree
xcener: -151.868364186796 hartree
chargesum: -0.0000000
charge: -0.037465 -0.041311 -0.265563 -0.368725 -0.293683 -0.000898 0.090563 0.006688 -0.116723 -0.259187 -0.228097 -0.184554 0.347859 0.036671 0.337119 0.049203 -0.278133 -0.209270 -0.163164 0.248586 -0.085294 -0.212160 0.257183 -0.205052 -0.189658 -0.092745 -0.097692 -0.141865 0.100774 0.081779 0.089179 0.091500 0.102120 0.095357 0.072949 0.098305 0.108050 0.108730 0.130090 0.113057 0.128446 0.128593 0.124810 0.137395 0.126953 0.131453 0.127829
qa: -0.0375 -0.0413 -0.2656 -0.3687 -0.2937 -0.0009 0.0906 0.0067 -0.1167 -0.2592 -0.2281 -0.1846 0.3479 0.0367 0.3371 0.0492 -0.2781 -0.2093 -0.1632 0.2486 -0.0853 -0.2122 0.2572 -0.2051 -0.1897 -0.0927 -0.0977 -0.1419 0.1008 0.0818 0.0892 0.0915 0.1021 0.0954 0.0729 0.0983 0.1080 0.1087 0.1301 0.1131 0.1284 0.1286 0.1248 0.1374 0.1270 0.1315 0.1278
va: 1.2907 1.2653 2.1589 2.1356 2.1218 3.1175 3.7518 3.8186 3.9248 3.9119 3.9014 3.8718 4.2406 4.2363 3.8091 3.7442 4.0155 3.9979 3.9803 3.8497 3.9603 4.0414 3.7736 4.0513 3.9788 3.9293 3.9419 3.9621 1.0384 1.0347 1.0012 1.0035 1.0196 1.0045 1.0081 1.0046 1.0208 1.0347 1.0180 1.0103 0.9999 1.0129 1.0133 1.0024 0.9989 0.9991 1.0002
dispcorr: -0.022789158 hartree
energy: -2050.683868087214
dipole: 18.81765 -18.58607 0.23159 20.39263 -20.19296 0.19966 -18.93465 17.07489 -1.85977
magnitude: 1.88474 au
magnitude: 4.79062 debye
