program: Orca
programVersion: 5.0.2
elementType: Cl Cl O O O N C C C C C C C C C C C C C C C C C C C C C C H H H H H H H H H H H H H H H H H H H
charge: 0
multiplicity: 1
keywords: wb97x-d3
keywords: def2-TZVPP
keywords: def2/J RIJCOSX
keywords: DEFGRID2
keywords: scfconv7
keywords: smallprint printgap noloewdin
keywords: NOSOSCF
formula: C22H19Cl2NO3
InChI: InChI=1/C22H19Cl2NO3/c1-22(2)17(12-19(23)24)20(22)21(26)28-18(13-25)14-7-6-10-16(11-14)27-15-8-4-3-5-9-15/h3-12,17-18,20H,1-2H3
47 atoms
Cl -4.04751 -3.970343 -0.526344
Cl -2.893062 -6.557481 0.011584
O  1.399829 -1.028884 -0.314028
O  -0.675414 -0.208772 -0.143749
O  1.207729 4.68108 0.668229
N  3.77023 -0.616188 -2.589649
C  -0.893519 -2.268311 2.209626
C  -1.522018 -2.844509 0.976532
C  -0.111765 -2.284801 0.911357
C  -1.461441 -0.98001 2.754167
C  -0.386486 -3.190188 3.293935
C  -1.721505 -4.286944 0.792769
C  0.125411 -1.063705 0.116111
C  -2.751385 -4.852008 0.174278
C  1.78658 0.120719 -1.057188
C  2.194084 1.254232 -0.148331
C  2.901615 -0.308331 -1.904284
C  1.496026 2.450246 -0.195446
C  3.246839 1.084133 0.743433
C  1.869085 3.494315 0.644044
C  3.594735 2.124013 1.587911
C  2.916418 3.3321 1.538878
C  0.70134 5.196161 -0.493844
C  1.485132 5.319389 -1.634443
C  -0.609477 5.645945 -0.483892
C  0.941857 5.898959 -2.769771
C  -1.137643 6.23238 -1.624329
C  -0.367913 6.358025 -2.770881
H  -2.26963 -2.209787 0.514848
H  0.695652 -3.007045 0.868958
H  -0.690961 -0.406047 3.271516
H  -2.246366 -1.208043 3.476869
H  -1.891939 -0.344499 1.985217
H  -1.209706 -3.521549 3.928649
H  0.331912 -2.666764 3.926002
H  0.11262 -4.078196 2.907902
H  -0.969911 -4.961287 1.183651
H  0.974078 0.444879 -1.714952
H  0.659313 2.564759 -0.873304
H  3.795317 0.151324 0.774905
H  4.413702 2.001726 2.283858
H  3.192054 4.15107 2.189986
H  2.511299 4.973567 -1.634593
H  -1.204116 5.540342 0.41407
H  1.552331 5.998195 -3.657741
H  -2.160104 6.586545 -1.615234
H  -0.784033 6.812768 -3.65953
totalener: -2050.66162949 hartree
nucrepener: 2685.78790366 hartree
electener: -4736.44953315 hartree
oneelecener: -8146.84405127 hartree
twoeener: 3410.39451812 hartree
kineticenergy: 2044.53352304 hartree
xcener: -151.870238196683 hartree
chargesum: -0.0000000
charge: -0.038514 -0.043888 -0.263560 -0.377972 -0.298041 -0.000934 0.067427 0.037697 -0.090697 -0.245339 -0.249712 -0.200929 0.356333 0.051667 0.314467 0.003860 -0.254629 -0.091758 -0.188659 0.186758 -0.096224 -0.185795 0.213250 -0.146531 -0.193756 -0.119099 -0.096362 -0.135883 0.088192 0.082167 0.088932 0.089900 0.102958 0.100751 0.094327 0.074548 0.096879 0.118107 0.121473 0.123036 0.129542 0.130284 0.135078 0.126743 0.129675 0.127164 0.127068
qa: -0.0385 -0.0439 -0.2636 -0.3780 -0.2980 -0.0009 0.0674 0.0377 -0.0907 -0.2453 -0.2497 -0.2009 0.3563 0.0517 0.3145 0.0039 -0.2546 -0.0918 -0.1887 0.1868 -0.0962 -0.1858 0.2133 -0.1465 -0.1938 -0.1191 -0.0964 -0.1359 0.0882 0.0822 0.0889 0.0899 0.1030 0.1008 0.0943 0.0745 0.0969 0.1181 0.1215 0.1230 0.1295 0.1303 0.1351 0.1267 0.1297 0.1272 0.1271
va: 1.2891 1.2611 2.1353 2.1269 2.1073 3.1193 3.7584 3.8375 3.8663 3.9137 3.9118 3.9239 4.2339 4.2551 3.8452 3.6545 4.0215 3.8959 4.0318 3.8900 3.9464 4.0329 3.8308 3.9488 4.0361 3.9514 3.9372 3.9569 1.0496 1.0350 1.0021 1.0010 1.0212 1.0020 1.0043 1.0102 1.0318 1.0221 1.0201 1.0165 0.9992 1.0110 1.0030 1.0129 0.9996 0.9989 0.9999
dispcorr: -0.022941827 hartree
energy: -2050.684571318486
dipole: 14.23686 -14.49770 -0.26084 29.68100 -29.09739 0.58361 14.51463 -13.20852 1.30611
magnitude: 1.45416 au
magnitude: 3.69617 debye
