program: Orca
programVersion: 5.0.2
elementType: Cl Cl O O O N C C C C C C C C C C C C C C C C C C C C C C H H H H H H H H H H H H H H H H H H H
charge: 0
multiplicity: 1
keywords: wb97x-d3
keywords: def2-TZVPP
keywords: def2/J RIJCOSX
keywords: DEFGRID2
keywords: scfconv7
keywords: smallprint printgap noloewdin
keywords: NOSOSCF
formula: C22H19Cl2NO3
InChI: InChI=1/C22H19Cl2NO3/c1-22(2)17(12-19(23)24)20(22)21(26)28-18(13-25)14-7-6-10-16(11-14)27-15-8-4-3-5-9-15/h3-12,17-18,20H,1-2H3
47 atoms
Cl -3.315098 -1.245041 1.598258
Cl -4.799683 -0.461277 -0.751387
O  1.774644 -1.478454 0.090991
O  2.285148 -1.892102 -2.04472
O  1.218384 3.598777 -0.071855
N  3.540412 -1.091427 2.855426
C  -0.612302 -3.365122 -0.459946
C  -1.021268 -1.924356 -0.348177
C  0.071696 -2.313616 -1.313215
C  0.092723 -4.007201 0.709597
C  -1.51409 -4.321099 -1.202672
C  -2.306984 -1.431181 -0.876299
C  1.479965 -1.887039 -1.158034
C  -3.338707 -1.103073 -0.110375
C  3.07149 -0.937573 0.289029
C  3.159566 0.4959 -0.179705
C  3.319236 -1.028969 1.730123
C  2.113873 1.365049 0.106972
C  4.278598 0.933272 -0.86615
C  2.194412 2.685879 -0.309167
C  4.356416 2.263278 -1.257097
C  3.322717 3.139636 -0.986699
C  -0.034929 3.145636 0.256284
C  -0.86329 2.635828 -0.733209
C  -0.463332 3.226261 1.570704
C  -2.136338 2.203972 -0.397087
C  -1.740634 2.790164 1.895552
C  -2.577565 2.275608 0.917024
H  -0.69094 -1.430233 0.558973
H  -0.200033 -2.34893 -2.362949
H  0.653254 -3.302036 1.317468
H  0.780667 -4.783432 0.369546
H  -0.643234 -4.483293 1.358975
H  -0.947812 -5.186062 -1.550783
H  -1.989787 -3.867269 -2.071636
H  -2.307847 -4.682227 -0.546926
H  -2.425005 -1.31065 -1.946412
H  3.827393 -1.540824 -0.224395
H  1.246025 1.012951 0.649944
H  5.080195 0.245989 -1.103093
H  5.226252 2.616291 -1.794328
H  3.374443 4.173899 -1.300062
H  -0.513459 2.586166 -1.756462
H  0.197563 3.626704 2.328275
H  -2.790059 1.81319 -1.165139
H  -2.078879 2.850136 2.921387
H  -3.571091 1.934137 1.173458
totalener: -2050.65773060 hartree
nucrepener: 2927.86602661 hartree
electener: -4978.52375721 hartree
oneelecener: -8630.81812500 hartree
twoeener: 3652.29436779 hartree
kineticenergy: 2044.54287796 hartree
xcener: -151.873443218887 hartree
chargesum: -0.0000000
charge: -0.035185 -0.043994 -0.280501 -0.334931 -0.297956 0.002205 0.127752 -0.011235 -0.115694 -0.263021 -0.235400 -0.182841 0.325356 0.023168 0.274688 0.060343 -0.261601 -0.160564 -0.167211 0.212431 -0.080378 -0.198991 0.209875 -0.152183 -0.167870 -0.122876 -0.115186 -0.112957 0.103209 0.083837 0.097798 0.095854 0.089823 0.097941 0.075858 0.096221 0.114059 0.126953 0.124644 0.106891 0.126656 0.127993 0.129078 0.128505 0.124567 0.128909 0.125964
qa: -0.0352 -0.0440 -0.2805 -0.3349 -0.2980 0.0022 0.1278 -0.0112 -0.1157 -0.2630 -0.2354 -0.1828 0.3254 0.0232 0.2747 0.0603 -0.2616 -0.1606 -0.1672 0.2124 -0.0804 -0.1990 0.2099 -0.1522 -0.1679 -0.1229 -0.1152 -0.1130 0.1032 0.0838 0.0978 0.0959 0.0898 0.0979 0.0759 0.0962 0.1141 0.1270 0.1246 0.1069 0.1267 0.1280 0.1291 0.1285 0.1246 0.1289 0.1260
va: 1.2907 1.2624 2.0921 2.1751 2.1168 3.1167 3.7253 3.7734 3.9255 3.9254 3.9139 3.8248 4.2721 4.2190 3.8781 3.6786 4.0095 3.9210 4.0408 3.8729 3.9558 4.0353 3.8420 4.0171 4.0172 3.8766 3.9867 3.8836 1.0233 1.0331 1.0121 1.0010 1.0048 1.0041 1.0070 1.0045 1.0164 1.0205 1.0235 1.0127 0.9995 1.0127 1.0071 1.0098 1.0088 1.0002 1.0169
dispcorr: -0.029271764 hartree
energy: -2050.687002365855
dipole: 13.84831 -14.51580 -0.66750 -8.08699 7.77365 -0.31333 -5.96707 5.00922 -0.95786
magnitude: 1.20881 au
magnitude: 3.07255 debye
