program: Orca
programVersion: 5.0.2
elementType: Cl Cl O O O N C C C C C C C C C C C C C C C C C C C C C C H H H H H H H H H H H H H H H H H H H
charge: 0
multiplicity: 1
keywords: wb97x-d3
keywords: def2-TZVPP
keywords: def2/J RIJCOSX
keywords: DEFGRID2
keywords: scfconv7
keywords: smallprint printgap noloewdin
keywords: NOSOSCF
formula: C22H19Cl2NO3
InChI: InChI=1/C22H19Cl2NO3/c1-22(2)17(12-19(23)24)20(22)21(26)28-18(13-25)14-7-6-10-16(11-14)27-15-8-4-3-5-9-15/h3-12,17-18,20H,1-2H3
47 atoms
Cl -4.070317 -3.952061 -0.592819
Cl -2.85545 -6.473542 0.101598
O  1.509153 -0.939714 -0.175048
O  -0.565108 -0.115946 -0.35811
O  1.135578 4.691104 0.695622
N  4.112751 -0.759108 -2.209374
C  -1.135921 -1.989468 2.08234
C  -1.569893 -2.675053 0.821034
C  -0.168328 -2.101631 0.921069
C  -1.786428 -0.672018 2.427235
C  -0.800423 -2.815239 3.302076
C  -1.735243 -4.131788 0.734789
C  0.187364 -0.945439 0.07426
C  -2.752436 -4.758656 0.155651
C  2.010472 0.145872 -0.948702
C  2.356846 1.325791 -0.073991
C  3.188366 -0.373643 -1.647154
C  1.573528 2.468983 -0.136873
C  3.423688 1.247656 0.812954
C  1.876075 3.552033 0.681305
C  3.704758 2.327445 1.632599
C  2.941543 3.48205 1.567841
C  0.516146 5.110763 -0.450525
C  1.224264 5.279785 -1.633534
C  -0.833492 5.416863 -0.383472
C  0.564801 5.755691 -2.755459
C  -1.479517 5.900464 -1.511593
C  -0.786596 6.066899 -2.700652
H  -2.246122 -2.09358 0.204572
H  0.63685 -2.814429 1.059008
H  -1.110009 -0.048182 3.013865
H  -2.674764 -0.857446 3.033213
H  -2.092054 -0.104494 1.552731
H  -1.711647 -3.106899 3.82646
H  -0.188715 -2.233666 3.992932
H  -0.24793 -3.724908 3.069188
H  -0.968984 -4.761031 1.17146
H  1.279548 0.446649 -1.705362
H  0.726489 2.508281 -0.810094
H  4.038751 0.357874 0.856975
H  4.537017 2.277874 2.321685
H  3.165318 4.331741 2.199213
H  2.281084 5.048581 -1.676935
H  -1.366953 5.281434 0.548061
H  1.115198 5.889887 -3.677225
H  -2.532859 6.14128 -1.458487
H  -1.294453 6.440338 -3.579387
totalener: -2050.66192105 hartree
nucrepener: 2693.33578591 hartree
electener: -4743.99770696 hartree
oneelecener: -8161.94356843 hartree
twoeener: 3417.94586147 hartree
kineticenergy: 2044.52784368 hartree
xcener: -151.869325915186 hartree
chargesum: 0.0000000
charge: -0.038821 -0.043296 -0.259883 -0.383731 -0.297365 -0.002424 0.067883 0.042849 -0.104102 -0.247914 -0.240838 -0.201405 0.368260 0.049563 0.316757 -0.011523 -0.257225 -0.098342 -0.180196 0.196905 -0.097362 -0.190421 0.216689 -0.151927 -0.189512 -0.117333 -0.098011 -0.134723 0.088042 0.081440 0.088572 0.090026 0.102936 0.100186 0.094242 0.072948 0.098645 0.118076 0.126708 0.121655 0.129705 0.129666 0.134737 0.125731 0.129531 0.126993 0.127609
qa: -0.0388 -0.0433 -0.2599 -0.3837 -0.2974 -0.0024 0.0679 0.0428 -0.1041 -0.2479 -0.2408 -0.2014 0.3683 0.0496 0.3168 -0.0115 -0.2572 -0.0983 -0.1802 0.1969 -0.0974 -0.1904 0.2167 -0.1519 -0.1895 -0.1173 -0.0980 -0.1347 0.0880 0.0814 0.0886 0.0900 0.1029 0.1002 0.0942 0.0729 0.0986 0.1181 0.1267 0.1217 0.1297 0.1297 0.1347 0.1257 0.1295 0.1270 0.1276
va: 1.2885 1.2619 2.1376 2.1176 2.1093 3.1178 3.7524 3.8284 3.8887 3.9141 3.9088 3.9168 4.2198 4.2505 3.8381 3.6745 4.0215 3.8736 4.0399 3.8831 3.9495 4.0355 3.8287 3.9571 4.0389 3.9492 3.9381 3.9574 1.0485 1.0362 1.0021 1.0010 1.0214 1.0026 1.0046 1.0100 1.0295 1.0216 1.0231 1.0155 0.9995 1.0115 1.0030 1.0129 0.9996 0.9990 0.9998
dispcorr: -0.022995542 hartree
energy: -2050.684916593824
dipole: 11.59529 -12.05326 -0.45797 30.79958 -30.07324 0.72634 13.58435 -12.38460 1.19974
magnitude: 1.47536 au
magnitude: 3.75007 debye
